Syn 4,9-bis(methoxycarbonyl)pagodane (dimethyl undecacyclo [9.9.0.01,5.02,12.02,18.03,7.06,10.08,12.011,15.013,17.016,20]-eicosane-4-syn, 9-syn-dicarboxylate)

Phase change data

Data compiled by: William E. Acree, Jr., James S. Chickos

Enthalpy of sublimation

ΔsubH (kcal/mol) Temperature (K) Method Reference Comment
34.92 ± 0.72420.TBeckhaus, Ruechardt, et al., 1994Based on data from 393. - 447. K.

References

Beckhaus, Ruechardt, et al., 1994
Beckhaus, Hans-Dieter; Ruechardt, Christoph; Lagerwall, Dean R.; Paquette, Leo A.; Wahl, Fabian; Prinzbach, Horst, Experimental Enthalpies of Formation and Strain Energies for the Caged C20H20 Pagodane and Dodecahedrane Frameworks, J. Am. Chem. Soc., 1994, 116, 26, 11775-11778, https://doi.org/10.1021/ja00105a018 . [all data]