4-Chloro-2-nitrophenol

Normal alkane RI, polar column, custom temperature program

View large format table.

Column type Active phase I Reference Comment
CapillaryBP-202907.Rodrigues, Caldera, et al., 200830. m/0.25 mm/0.25 μm, Helium; Program: 40 0C (1 min) 2 0C/min -> 100 0C (2 min) 1.7 0C/min -> 180 0C (1 min) 25 0C/min -> 220 0C (10 min)

References

Rodrigues, Caldera, et al., 2008
Rodrigues, F.; Caldera, M.; Camara, J.S., development of a dynamic headspace solid-phase microextraction procedure coupled to GC-qMSD for evaluation the chemical profile in alcoholic beverages, Anal. Chim. Acta, 2008, 609, 1, 82-104, https://doi.org/10.1016/j.aca.2007.12.041 . [all data]