(3β)-choles-5-en-yl 2,2,3,3,4,4,,5,5-octafluoropentanoate

Phase change data

Data compiled by: Thermodynamics Research Center, NIST Boulder Laboratories, Chris Muzny director

Quantity Value Units Method Reference Comment
Tfus382.KN/AYano, Matsumoto, et al., 1984Crystal phase 1 phase; Uncertainty assigned by TRC = 4. K

In addition to the Thermodynamics Research Center (TRC) data available from this site, much more physical and chemical property data is available from the following TRC products:

References

Yano, Matsumoto, et al., 1984
Yano, S.; Matsumoto, N.; Aoki, K.; Nakamura, N., Phase Transitions of Cholestery Fluoroalkanoates, Mol. Cryst. Liq. Cryst., 1984, 104, 153-9. [all data]