Fluoranthene, 3-nitro-
- Formula: C16H9NO2
- Molecular weight: 247.2482
- IUPAC Standard InChIKey: PIHGQKMEAMSUNA-UHFFFAOYSA-N
- CAS Registry Number: 892-21-7
- Chemical structure:

Phase change data

Data compiled by: William E. Acree, Jr., James S. Chickos
Enthalpy of fusion
ΔfusH (kJ/mol) | Temperature (K) | Method | Reference |
---|---|---|---|
22.6 | 435.0 | DSC | Kestens, Auclair, et al., 2010 |

Normal alkane RI, non-polar column, temperature ramp

Column type | Active phase | I | Reference | Comment |
---|---|---|---|---|
Capillary | Ultra-1 | 2433. | Okumura, 1991 | 25. m/0.32 mm/0.25 μm, He, 3. K/min; Tstart: 80. C; Tend: 260. C |

Lee's RI, non-polar column, temperature ramp

Column type | Active phase | I | Reference | Comment |
---|---|---|---|---|
Capillary | HP-5 | 412.45 | Pedersen, Durant, et al., 2005 | 30. m/0.25 mm/0.25 μm, Helium, 50. C @ 1.5 min, 6. K/min, 310. C @ 10. min |
Capillary | SE-52 | 413.34 | White, Robbat, et al., 1983 | 30. m/0.3 mm/0.25 μm, He, 4. K/min; Tstart: 25. C; Tend: 295. C |

Lee's RI, non-polar column, custom temperature program

Column type | Active phase | I | Reference | Comment |
---|---|---|---|---|
Capillary | DB-5 | 411.89 | Ciccioli, Cecinato, et al., 1988 | Column diameter: 0.32 mm; Phase thickness: 1.0 μm; Program: 30 0C 20 0C/min -> 180 0C (3 min) 3 0C/min -> 270 0C |
Capillary | DB-5 | 413.24 | Ciccioli, Cecinato, et al., 1988 | Column diameter: 0.32 mm; Phase thickness: 1.0 μm; Program: not specified |
Capillary | DB-5 | 413.33 | Ciccioli, Cecinato, et al., 1988 | Column diameter: 0.32 mm; Phase thickness: 1.0 μm; Program: not specified |
Capillary | DB-5 | 413.34 | Ciccioli, Cecinato, et al., 1988 | Column diameter: 0.32 mm; Phase thickness: 1.0 μm; Program: not specified |
Capillary | OV-101 | 419.8 | Tucminen, Wickstrom, et al., 1986 | Program: not specified |
Capillary | OV-101 | 423.9 | Tucminen, Wickstrom, et al., 1986 | Program: not specified |

References

Kestens, Auclair, et al., 2010
Kestens, Vikram; Auclair, Guy; Drozdzewska, Katarzyna; Held, Andrea; Roebben, Gert; Linsinger, Thomas,
Thermodynamic property values of selected polycyclic aromatic hydrocarbons measured by differential scanning calorimetry,
J Therm Anal Calorim, 2010, 99, 1, 245-261, https://doi.org/10.1007/s10973-009-0440-6
. [all data]
Okumura, 1991
Okumura, T.,
retention indices of environmental chemicals on methyl silicone capillary column,
Journal of Environmental Chemistry (Japan), 1991, 1, 2, 333-358, https://doi.org/10.5985/jec.1.333
. [all data]
Pedersen, Durant, et al., 2005
Pedersen, D.U.; Durant, J.L.; Taghizadeh, K.; Hemond, H.F.; Lafleur, A.L.; Cass, G.R.,
Human cell mutagenes in respirable airborne particles from the Northeastern United States. 2. Quantification of mutagenes and other organic compounds.,
Environ. Sci. Technol., 2005, 39, 24, 9547-9560, https://doi.org/10.1021/es050886c
. [all data]
White, Robbat, et al., 1983
White, C.M.; Robbat, A., Jr.; Hoes, R.M.,
Gas chromatographic retention characteristics of nitrated polycyclic aromatic hydrocarbons on SE-52,
Chromatographia, 1983, 17, 11, 605-612, https://doi.org/10.1007/BF02261944
. [all data]
Ciccioli, Cecinato, et al., 1988
Ciccioli, P.; Cecinato, A.; Brancaleoni, E.; Liberti, A.,
Short capillary column for the separation and identification of mononitrofluoranthene and mononitropyrene isomers present in air and emission samples,
J. Hi. Res. Chromatogr. Chromatogr. Comm., 1988, 11, 4, 306-312, https://doi.org/10.1002/jhrc.1240110402
. [all data]
Tucminen, Wickstrom, et al., 1986
Tucminen, A.; Wickstrom, K.; Pyysalo, H.,
Determination of Polycyclic Aromatic Compounds by GLC-Selected Ion Monitoring (SIM) Technique,
J. Hi. Res. Chromatogr. Chromatogr. Comm., 1986, 9, 8, 469-471, https://doi.org/10.1002/jhrc.1240090813
. [all data]