(1-methylhexyl)cyclopentane

Phase change data

Data compiled by: Thermodynamics Research Center, NIST Boulder Laboratories, Chris Muzny director

Quantity Value Units Method Reference Comment
Tboil492.2KN/AFoehr and Fenske, 1949Uncertainty assigned by TRC = 2. K
Tboil492.2KN/AFenske, Braun, et al., 1947Uncertainty assigned by TRC = 0.4 K

In addition to the Thermodynamics Research Center (TRC) data available from this site, much more physical and chemical property data is available from the following TRC products:

References

Foehr and Fenske, 1949
Foehr, E.G.; Fenske, M.R., Magneto-optic Rotation of Hydrocarbons, Ind. Eng. Chem., 1949, 41, 1956. [all data]

Fenske, Braun, et al., 1947
Fenske, M.R.; Braun, W.G.; Wiegand, R.V.; Quiggle, D.; McCormick, R.H.; Rank, D.H., Raman Spectra of Hydrocarbons, Anal. Chem., 1947, 19, 700. [all data]