1-nonadecanol, 18-methyl-

Phase change data

Data compiled by: Thermodynamics Research Center, NIST Boulder Laboratories, Chris Muzny director

Quantity Value Units Method Reference Comment
Tfus322.95KN/AMilburn and Truter, 1954Uncertainty assigned by TRC = 0.5 K

In addition to the Thermodynamics Research Center (TRC) data available from this site, much more physical and chemical property data is available from the following TRC products:

References

Milburn and Truter, 1954
Milburn, A.H.; Truter, E.V., Components of Wool Wax II. Synthesis of the Acids and Alcohols of the Iso- and the (+)-Anteiso-Series, J. Chem. Soc., 1954, 1954, 3344. [all data]