Tetrapotassium monoxide

Gas phase ion energetics data

Data compiled by: Sharon G. Lias, John E. Bartmess, Joel F. Liebman, John L. Holmes, Rhoda D. Levin, and W. Gary Mallard

Ionization energy determinations

IE (eV) Method Reference
3.62 ± 0.04PIDao, Peterson, et al., 1984

References

Dao, Peterson, et al., 1984
Dao, P.D.; Peterson, K.I.; Castleman, A.W., Jr., The photoionization of oxidized metal clusters, J. Chem. Phys., 1984, 80, 563. [all data]