Benzoic acid, 2,3,5-triiodo-

Phase change data

Data compiled as indicated in comments:
TRC - Thermodynamics Research Center, NIST Boulder Laboratories, Chris Muzny director
AC - William E. Acree, Jr., James S. Chickos

Quantity Value Units Method Reference Comment
Tfus503.8KN/APlato, 1972Uncertainty assigned by TRC = 0.2 K; TRC

Enthalpy of fusion

ΔfusH (kJ/mol) Temperature (K) Reference Comment
32.23503.8Acree, 1991AC

In addition to the Thermodynamics Research Center (TRC) data available from this site, much more physical and chemical property data is available from the following TRC products:

References

Plato, 1972
Plato, C., DSC as a general method for determining purity and heat of fusion of high-purity organic chemicals, Anal. Chem., 1972, 44, 1531. [all data]

Acree, 1991
Acree, William E., Thermodynamic properties of organic compounds: enthalpy of fusion and melting point temperature compilation, Thermochimica Acta, 1991, 189, 1, 37-56, https://doi.org/10.1016/0040-6031(91)87098-H . [all data]