Molybdenum, (η6-benzene)[η6-5-(1-methylethylidene-1,3-cyclopentadiene]-

Gas phase ion energetics data

Data compiled by: Sharon G. Lias, John E. Bartmess, Joel F. Liebman, John L. Holmes, Rhoda D. Levin, and W. Gary Mallard

Ionization energy determinations

IE (eV) Method Reference Comment
5.7PEBandy, Mtetwa, et al., 1985
6.00PEBandy, Mtetwa, et al., 1985Vertical value

References

Bandy, Mtetwa, et al., 1985
Bandy, J.A.; Mtetwa, V.S.B.; Prout, K.; Green, J.C.; Davies, C.E.; Green, M.L.H.; Hazel, N.J.; Izquierdo, A.; Martin-Polo, J.J., Synthesis, structure, and bonding of fulvene complexes of titanium, molybdenum, and tungsten, J. Chem. Soc. Dalton Trans., 1985, 2037. [all data]