Monoeuropium monovandium dioxide

Gas phase ion energetics data

Data compiled by: Sharon G. Lias, John E. Bartmess, Joel F. Liebman, John L. Holmes, Rhoda D. Levin, and W. Gary Mallard

Ionization energy determinations

IE (eV) Method Reference
8. ± 1.EIBalducci, Gigli, et al., 1983

References

Balducci, Gigli, et al., 1983
Balducci, G.; Gigli, G.; Guido, M., Thermodynamic study of gaseous ternary oxide molecules. The europium-vanadium-oxygen system, J. Chem. Phys., 1983, 79, 5623. [all data]