1,5-di-2-furylpenta-1,4-dien-3-one

Condensed phase thermochemistry data

Data compiled by: Hussein Y. Afeefy, Joel F. Liebman, and Stephen E. Stein

Quantity Value Units Method Reference Comment
Δfsolid-201.2kJ/molCcbAvramescu and Isagescu, 1978
Quantity Value Units Method Reference Comment
Δcsolid-6343.7 ± 2.5kJ/molCcbAvramescu and Isagescu, 1978Corresponding Δfsolid = -201.1 kJ/mol (simple calculation by NIST; no Washburn corrections)

References

Avramescu and Isagescu, 1978
Avramescu, F.; Isagescu, D.A., Heats of combustion of mono- and difurfurylidene acetone, Rev. Roum. Chim., 1978, 23, 655-659. [all data]