Myclobutanil

Phase change data

Data compiled by: William E. Acree, Jr., James S. Chickos

Enthalpy of fusion

ΔfusH (kJ/mol) Temperature (K) Reference
30.93348.8Sun, Liu, et al., 2005

Normal alkane RI, non-polar column, custom temperature program

View large format table.

Column type Active phase I Reference Comment
CapillarySiloxane, 5 % Ph2210.VOC BinBase, 2012Program: not specified
CapillaryPolydimethyl siloxane, 5 % phenyl2210.Skogerson, Wohlgemuth, et al., 2011Program: not specified
Capillary5 % Phenyl methyl siloxane2198.Department of Food Safety and Welfare, 200630. m/0.25 mm/0.25 μm, Helium; Program: 50 0C(1 min) 25 0C/min -> 125 0C 10 0C/min -> 300 0C (10 min)
Capillary5 % Phenyl methyl siloxane2198.Department of Food Safety and Welfare, 200630. m/0.25 mm/0.25 μm, Helium; Program: 50 0C(1 min) 25 0C/min -> 125 0C 10 0C/min -> 300 0C (10 min)

References

Sun, Liu, et al., 2005
Sun, Xiao-Hong; Liu, Yuan-Fa; Tan, Zhi-Cheng; Jia, Ying-Qi; Wang, Mei-Han; Di, You-Ying, Heat Capacity and Thermodynamic Properties of Myclobutanil, Chin. J. Chem., 2005, 23, 1, 23-27, https://doi.org/10.1002/cjoc.200590006 . [all data]

VOC BinBase, 2012
VOC BinBase, The volatile compound BinBase (VOC BinBase), 2012, retrieved from http://fiehnlab.ucdavis.edu/projects/VocBinBase and http://binbase.sourceforge.net. [all data]

Skogerson, Wohlgemuth, et al., 2011
Skogerson, K.; Wohlgemuth, G.; Fiehn, O., VocBinNase, 2011, retrieved from http://fiehnlab.ucdavis.edu/projects//VocBinBase. [all data]

Department of Food Safety and Welfare, 2006
Department of Food Safety, Ministry of Health; Welfare, Analytical methods for residual compositional substances of agricultural chemicals, feed aadditives, and veterinary drugs in foods, 2006, retrieved from http://www.mhlw.go.jp/english/topics/foodsafety/positivelist060228/de/060526-1a.pdf. [all data]