Bicyclo[4.4.1]undeca-1,3,5,7,9-pentaene-2-sulfonyl chloride, 11,11-difluoro-

Gas phase ion energetics data

Data compiled as indicated in comments:
LBLHLM - Sharon G. Lias, John E. Bartmess, Joel F. Liebman, John L. Holmes, Rhoda D. Levin, and W. Gary Mallard

Ionization energy determinations

IE (eV) Method Reference Comment
8.90PEAndrea, Cerfontain, et al., 1984Vertical value; LBLHLM

References

Andrea, Cerfontain, et al., 1984
Andrea, R.R.; Cerfontain, H.; Lamberchts, H.J.A.; Louwen, J.N.; Oskam, A., He I and He II photoelectron spectra and CNDO/S and MNDO MO calculations of some bridged [10] annulenes, J. Am. Chem. Soc., 1984, 106, 2531. [all data]