HFeI

Vibrational and/or electronic energy levels

Data compiled by: Marilyn E. Jacox

State:   X

Vib.
sym.
 No.   Approximate
 type of mode
 cm-1   Med.   Method   References

FeH stretch 1754 Ar IR Parker, Peden, et al., 1984

Additional references: Jacox, 1994, page 35

References

Parker, Peden, et al., 1984
Parker, S.F.; Peden, C.H.F.; Barrett, P.H.; Pearson, R.G., Matrix isolation infrared and Moessbauer studies of the oxidative addition reactions of the hydrogen halides with iron atoms, J. Am. Chem. Soc., 1984, 106, 5, 1304, https://doi.org/10.1021/ja00317a022 . [all data]

Jacox, 1994
Jacox, M.E., Vibrational and electronic energy levels of polyatomic transient molecules, American Chemical Society, Washington, DC, 1994, 464. [all data]