Benzoic acid, 4-hydroxy-3,5-dimethoxy-, methyl ester

Van Den Dool and Kratz RI, non-polar column, temperature ramp

View large format table.

Column type Active phase I Reference Comment
CapillaryOV-11725.Tan, Holland, et al., 1988He, 8. K/min, 280. C @ 10. min; Column length: 25. m; Column diameter: 0.32 mm; Tstart: 40. C

Van Den Dool and Kratz RI, polar column, temperature ramp

View large format table.

Column type Active phase I Reference Comment
CapillaryDB-Wax2957.Wirth, Guo, et al., 200130. m/0.32 mm/0.5 μm, He, 60. C @ 3. min, 3. K/min, 245. C @ 20. min
CapillaryDB-Wax2957.Bureau, Baumes, et al., 200030. m/0.32 mm/0.5 μm, He, 60. C @ 3. min, 3. K/min, 245. C @ 20. min

Normal alkane RI, non-polar column, temperature ramp

View large format table.

Column type Active phase I Reference Comment
CapillaryHP-5 MS1744.Jerkovic, Hegic, et al., 201030. m/0.25 mm/0.25 μm, Helium, 70. C @ 2. min, 3. K/min, 200. C @ 18. min
CapillaryHP-5 MS1744.Jerkovic and Marijanovic, 201030. m/0.25 mm/0.25 μm, Helium, 70. C @ 2. min, 3. K/min, 200. C @ 18. min
CapillaryHP-5 MS1744.Jerkovic, Tuberso, et al., 201030. m/0.25 mm/0.25 μm, Helium, 70. C @ 2. min, 3. K/min, 200. C @ 18. min

Normal alkane RI, non-polar column, custom temperature program

View large format table.

Column type Active phase I Reference Comment
CapillaryZB-51780.de Simon, Estruelas, et al., 200930. m/0.25 mm/0.25 μm, Helium; Program: 45 0C 3 0C/min -> 230 0C (10 min) 10 0C/min -> 270 0C (21 min)

Normal alkane RI, polar column, custom temperature program

View large format table.

Column type Active phase I Reference Comment
CapillarySupelcowax-102933.de Simon, Estruelas, et al., 200930. m/0.25 mm/0.25 μm, Helium; Program: 45 0C 3 0C/min -> 230 0C (10 min) 10 0C/min -> 270 0C (21 min)

References

Tan, Holland, et al., 1988
Tan, S.-T.; Holland, P.T.; Wilkins, A.L.; Molan, P.C., Extractives from New Zealand honeys. 1. White clovers, manuka, and kanuka unifloral honeys, J. Agric. Food Chem., 1988, 36, 3, 453-460, https://doi.org/10.1021/jf00081a012 . [all data]

Wirth, Guo, et al., 2001
Wirth, J.; Guo, W.; Baumes, R.; Günata, Z., Volatile compounds released by enzymatic hydrolysis of glycoconjugates of leaves and grape berries from Vitis vinifera muscat of Alexandria and Shiraz cultivars, J. Agric. Food Chem., 2001, 49, 6, 2917-2923, https://doi.org/10.1021/jf001398l . [all data]

Bureau, Baumes, et al., 2000
Bureau, S.M.; Baumes, R.L.; Razungles, A.J., Effects of vine or bunch shading on the glycosylated flavor precursors in grapes of Vitis vinifera L. Cv. Syrah, J. Agric. Food Chem., 2000, 48, 4, 1290-1297, https://doi.org/10.1021/jf990507x . [all data]

Jerkovic, Hegic, et al., 2010
Jerkovic, I.; Hegic, G.; Marijanovic, Z.; Bubalo, D., Organic extractives from Mentha spp. honey and the bee-stomach: methyl syringate, vomifoliol, terpenediol I, hotrienol, and other compounds, Molecules, 2010, 15, 4, 2911-2924, https://doi.org/10.3390/molecules15042911 . [all data]

Jerkovic and Marijanovic, 2010
Jerkovic, I.; Marijanovic, Z., Oak (Quercus frainetto Ten.) honeydaw honey - approach to screening of volatile organic composition and antioxidant capacity (DPPH and FRAP assay), Molecules, 2010, 15, 5, 3744-3756, https://doi.org/10.3390/molecules15053744 . [all data]

Jerkovic, Tuberso, et al., 2010
Jerkovic, I.; Tuberso, C.I.G.; Gugic, M.; Bubalo, D., Composition of Sulla (Hedysarum coronarium L.) honey solvent extractives determined by GC/MS: norisoprenoids and other volatile organic compounds, Molecules, 2010, 15, 9, 6375-6385, https://doi.org/10.3390/molecules15096375 . [all data]

de Simon, Estruelas, et al., 2009
de Simon, B.F.; Estruelas, E.; Munoz, A.M.; Cadahia, E.; Sanz, M., Volatile compounds in acacia, chestnut, cherry, ash, and oak woods, with a view to their use in cooperage, J. Agric. Food Chem., 2009, 57, 8, 3217-3227, https://doi.org/10.1021/jf803463h . [all data]