(1S,3aR,4R,8R,8aS)-1-Isopropyl-3a-methyl-7-methylenedecahydro-4,8-epoxyazulene

Normal alkane RI, non-polar column, temperature ramp

Data compiled by: NIST Mass Spectrometry Data Center, William E. Wallace, director

Column type CapillaryCapillaryCapillaryCapillaryCapillary
Active phase HP-5HP-5 MSSE-52HP-5 MSDB-1
Column length (m) 30.30.50.30.60.
Carrier gas HydrogenHeliumHeliumHeliumN2
Substrate
Column diameter (mm) 0.250.250.250.320.25
Phase thickness (μm) 0.250.250.250.250.25
Tstart (C) 70.70.60.60.60.
Tend (C) 290.290.280.280.250.
Heat rate (K/min) 5.5.3.4.5.
Initial hold (min)    5.
Final hold (min)  10.20. 10.
I 1576.1573.1578.1564.1571.
ReferenceRadulovic, Dordevic, et al., 2010Radulovic, Dordevic, et al., 2010, 2Djarri, Medjroubi, et al., 2008Capetanos, Saroglou, et al., 2007Fakhari A.R., Sonboli A., et al., 2005
Comment MSDC-RI MSDC-RI MSDC-RI MSDC-RI MSDC-RI
Column type Capillary
Active phase HP-5
Column length (m) 30.
Carrier gas He
Substrate
Column diameter (mm) 0.32
Phase thickness (μm) 0.25
Tstart (C) 60.
Tend (C) 260.
Heat rate (K/min) 5.
Initial hold (min) 2.
Final hold (min) 13.
I 1569.
ReferenceYayli, Yasar, et al., 2005
Comment MSDC-RI

Normal alkane RI, polar column, temperature ramp

Data compiled by: NIST Mass Spectrometry Data Center, William E. Wallace, director

Column type CapillaryCapillaryCapillaryCapillaryCapillary
Active phase HP InnowaxHP Innowax FSPInnowaxHP-InnowaxDB-Wax
Column length (m) 30.60.60.60.30.
Carrier gas HeliumHeHeHeN2
Substrate
Column diameter (mm) 0.320.250.250.250.25
Phase thickness (μm) 0.500.250.250.250.25
Tstart (C) 60.60.60.60.45.
Tend (C) 260.220.220.220.220.
Heat rate (K/min) 3.   3.
Initial hold (min)  10.10.10.
Final hold (min)  10.
I 1924.1945.1945.1945.1950.
ReferenceCapetanos, Saroglou, et al., 2007Kaya, Baser, et al., 1999Kaya, Baser, et al., 1999, 2Kaya, Baser, et al., 1999, 3Molleken U., Sinnwell V., et al., 1998
Comment MSDC-RI MSDC-RI MSDC-RI MSDC-RI MSDC-RI

Van Den Dool and Kratz RI, non-polar column, custom temperature program

Data compiled by: NIST Mass Spectrometry Data Center, William E. Wallace, director

Column type Capillary
Active phase HP-5MS
Column length (m) 30.
Carrier gas He
Substrate
Column diameter (mm) 0.25
Phase thickness (μm) 0.25
Program 60C (1 min) => 5 C/min => 210C => 10 C/min => 280C (15 min)
I 1573.5
ReferenceAndriamaharavo, 2014
Comment MSDC-RI

References

Radulovic, Dordevic, et al., 2010
Radulovic, N.S.; Dordevic, N.D.; Palic, R.M., Volatiles of Pleurospermum austriacum (L.) Hoffm. (Apiaceae), J. Serbian Chem. Soc., 2010, 75, 12, 1-11, https://doi.org/10.2298/JSC100323127R . [all data]

Radulovic, Dordevic, et al., 2010, 2
Radulovic, N.; Dordevic, N.; Markovic, M.; Palic, R., Volatile constituents of Glechoma Hirsuta Waldst. Kit. and G. Hederacea L. (Lamiaceae), Bull. Chem. Soc. Ethiop., 2010, 24, 1, 67-76, https://doi.org/10.4314/bcse.v24i1.52962 . [all data]

Djarri, Medjroubi, et al., 2008
Djarri, L.; Medjroubi, K.; Akkai, S.; Elomri, A.; Seguin, E.; Groult, M.-L.; Verite, P., Variability of two essential olis of Kundmannia sicula (L.) DC., a traditional Algerian medicinal plant, Molecules, 2008, 13, 4, 812-817, https://doi.org/10.3390/molecules13040812 . [all data]

Capetanos, Saroglou, et al., 2007
Capetanos, C.; Saroglou, V.; Marin, P.D.; Simic, A.; Skaltsa, H.D., Essential oil snalysis of two endemic Eringium species from Serbia, J. Serb. Chem. Soc., 2007, 72, 10, 961-965, https://doi.org/10.2298/JSC0710961C . [all data]

Fakhari A.R., Sonboli A., et al., 2005
Fakhari A.R.; Sonboli A.; Heydari R., Composition of the essential oil of Rhabdosciadium strausii from Iran, Chem. Nat. Compd. (Engl. Transl.), 2005, 41, 4, 413-414, https://doi.org/10.1007/s10600-005-0164-1 . [all data]

Yayli, Yasar, et al., 2005
Yayli, N.; Yasar, A.; Gülec, C.; Usta, A.; Kolayli, S.; Coskuncelebi, K.; Karaoglu, S., Composition and antimicrobial activity of essential oils from Centaurea sessilis and Centaurea armena, Phytochemistry, 2005, 66, 14, 1741-1745, https://doi.org/10.1016/j.phytochem.2005.04.006 . [all data]