1,3,3,5,7,7-Hexanitroperhydro-1,5-diazocine

Condensed phase thermochemistry data

Data compiled by: Hussein Y. Afeefy, Joel F. Liebman, and Stephen E. Stein

Quantity Value Units Method Reference Comment
Δfsolid-112.1 ± 6.1kJ/molCcrBaroody and Peters, 1987

References

Baroody and Peters, 1987
Baroody, E.E.; Peters, S.T., Heats of formation of propellant compounds (U), Rpt. IHSP-87-252 by Naval Ordnance Station, Indian Head, MD, 1987, 1-7. [all data]