Acridine, 9-[2-(2,3,5,6-tetramethylphenyl)ethenyl]-, (E)-

Reaction thermochemistry data

Data compiled by: Hussein Y. Afeefy, Joel F. Liebman, and Stephen E. Stein

Individual Reactions

C25H23N = C25H23N

By formula: C25H23N = C25H23N

Quantity Value Units Method Reference Comment
Δr-55.2 ± 0.4kJ/molCmBastianelli, Caia, et al., 1991liquid phase; Thermal Isomerization

References

Bastianelli, Caia, et al., 1991
Bastianelli, C.; Caia, V.; Cum, G.; Gallo, R.; Mancini, V., Thermal isomerization of photochemically synthesized (Z)-9-styrylacridines. An unusually high enthalpy of Z->E conversion for stilbene-like compounds, J. Chem. Soc. Perkin Trans. 2, 1991, 679-683. [all data]