Hexa-o-hexanoyl-scyllo-inositol

Phase change data

Data compiled by: Eugene S. Domalski and Elizabeth D. Hearing

Enthalpy of fusion

ΔfusH (kJ/mol) Temperature (K) Reference Comment
21.150341.6Kohne and Praefcke, 1984Solid-discotic.

Enthalpy of phase transition

ΔHtrs (kJ/mol) Temperature (K) Initial Phase Final Phase Reference Comment
8.840472.6liquid, Discoticliquid, isotropicKohne and Praefcke, 1984

References

Kohne and Praefcke, 1984
Kohne, B.; Praefcke, K., Liquid crystal compounds. Part 15. Hexa-o-alkanoyl-acyllo-inositols, first discotic liquid crystals from alicyclic saturated compounds, Angew Chem., 1984, 96, 70-71. [all data]