(n-C6H11)2O

Reaction thermochemistry data

Data compiled by: Michael M. Meot-Ner (Mautner) and Sharon G. Lias

Individual Reactions

CH6N+ + C12H22O = (CH6N+ • C12H22O)

By formula: CH6N+ + C12H22O = (CH6N+ • C12H22O)

Bond type: Hydrogen bonds of the type NH+-O between organics

Quantity Value Units Method Reference Comment
Δr27.2kcal/molPHPMSMeot-Ner, 1984gas phase; possible misprint, ligand n(C6H13)2O
Quantity Value Units Method Reference Comment
Δr31.4cal/mol*KPHPMSMeot-Ner, 1984gas phase; possible misprint, ligand n(C6H13)2O

Ion clustering data

Data compiled by: Michael M. Meot-Ner (Mautner) and Sharon G. Lias

Clustering reactions

CH6N+ + C12H22O = (CH6N+ • C12H22O)

By formula: CH6N+ + C12H22O = (CH6N+ • C12H22O)

Bond type: Hydrogen bonds of the type NH+-O between organics

Quantity Value Units Method Reference Comment
Δr27.2kcal/molPHPMSMeot-Ner, 1984gas phase; possible misprint, ligand n(C6H13)2O
Quantity Value Units Method Reference Comment
Δr31.4cal/mol*KPHPMSMeot-Ner, 1984gas phase; possible misprint, ligand n(C6H13)2O

References

Meot-Ner, 1984
Meot-Ner, (Mautner)M., The Ionic Hydrogen Bond and Ion Solvation. 1. -NH+ O-, -NH+ N- and -OH+ O- Bonds. Correlations with Proton Affinity. Deviations Due to Structural Effects, J. Am. Chem. Soc., 1984, 106, 5, 1257, https://doi.org/10.1021/ja00317a015 . [all data]