[4.2.2]Propella-2,4,7,9-tetraene

Gas phase ion energetics data

Data compiled by: Sharon G. Lias, John E. Bartmess, Joel F. Liebman, John L. Holmes, Rhoda D. Levin, and W. Gary Mallard

Ionization energy determinations

IE (eV) Method Reference
8.06PEGleiter, Krennrich, et al., 1986

References

Gleiter, Krennrich, et al., 1986
Gleiter, R.; Krennrich, G.; Bischof, P.; Tsuji, T.; Nishida, S., 103. PE spectra of dewar benzenes, bridged by a cyclohexadiene or a butadiene unit, Helv. Chim. Acta, 1986, 69, 962. [all data]