Chloroxylenol

Van Den Dool and Kratz RI, non-polar column, temperature ramp

Data compiled by: NIST Mass Spectrometry Data Center, William E. Wallace, director

Column type Capillary
Active phase DB-5
Column length (m) 30.
Carrier gas N2
Substrate
Column diameter (mm) 0.25
Phase thickness (μm) 0.25
Tstart (C) 40.
Tend (C) 230.
Heat rate (K/min) 5.
Initial hold (min) 2.
Final hold (min) 6.
I 1384.
ReferenceColahan-Sederstrom and Peterson, 2005
Comment MSDC-RI

References

Colahan-Sederstrom and Peterson, 2005
Colahan-Sederstrom, P.M.; Peterson, D.G., Inhibition of key aroma compound generated during ultrahigh-temperature processing of bovine milk via epicatechin addition, J. Agric. Food Chem., 2005, 53, 2, 398-402, https://doi.org/10.1021/jf0487248 . [all data]