Bergamotol, Z-α-trans-

Van Den Dool and Kratz RI, non-polar column, custom temperature program

Data compiled by: NIST Mass Spectrometry Data Center, William E. Wallace, director

Column type Capillary
Active phase BPX-5
Column length (m) 30.
Carrier gas He
Substrate
Column diameter (mm) 0.25
Phase thickness (μm) 0.25
Program not specified
I 1707.
ReferenceShellie, Marriott, et al., 2004
Comment MSDC-RI

References

Shellie, Marriott, et al., 2004
Shellie, R.; Marriott, P.; Morrison, P., Comprehensive two-dimensional gas chromatography with flame ionization and time-of-flight mass spectrometry detection: qualitative and quantitative analysis of West Australian sandalwood oil, J. Chromatogr. Sci., 2004, 42, 8, 417-422, https://doi.org/10.1093/chromsci/42.8.417 . [all data]