CAS Reg. No. 88032-19-3

Reaction thermochemistry data

Data compiled by: John E. Bartmess

Individual Reactions

(CAS Reg. No. 88032-19-3 • 42949672951,3-Butadiene) + 1,3-Butadiene = CAS Reg. No. 88032-19-3

By formula: (CAS Reg. No. 88032-19-3 • 4294967295C4H6) + C4H6 = CAS Reg. No. 88032-19-3

Quantity Value Units Method Reference Comment
Δr61.5 ± 8.8kJ/molN/ADePuy, Gronert, et al., 1989gas phase

References

DePuy, Gronert, et al., 1989
DePuy, C.H.; Gronert, S.; Barlow, S.E.; Bierbaum, V.M.; Damrauer, R., The Gas Phase Acidities of the Alkanes, J. Am. Chem. Soc., 1989, 111, 6, 1968, https://doi.org/10.1021/ja00188a003 . [all data]