Xylitol

Condensed phase thermochemistry data

Data compiled by: Hussein Y. Afeefy, Joel F. Liebman, and Stephen E. Stein

Quantity Value Units Method Reference Comment
Δfliquid-1118.6 ± 0.63kJ/molCcbOberemok-Yakubova and Balandin, 1963
Quantity Value Units Method Reference Comment
Δcliquid-2564.0 ± 0.63kJ/molCcbOberemok-Yakubova and Balandin, 1963Corresponding Δfliquid = -1118.5 kJ/mol (simple calculation by NIST; no Washburn corrections)

Phase change data

Data compiled as indicated in comments:
TRC - Thermodynamics Research Center, NIST Boulder Laboratories, Chris Muzny director
AC - William E. Acree, Jr., James S. Chickos
DH - Eugene S. Domalski and Elizabeth D. Hearing

Quantity Value Units Method Reference Comment
Tfus365.7KN/ABarone, DellaGatta, et al., 1990Uncertainty assigned by TRC = 0.2 K; TRC
Quantity Value Units Method Reference Comment
Δsub161.kJ/molBBarone, Gatta, et al., 1990AC

Enthalpy of vaporization

ΔvapH (kJ/mol) Temperature (K) Method Reference Comment
111.1 ± 0.8433.TEBarone, Gatta, et al., 1990Based on data from 406. - 460. K.; AC

Enthalpy of fusion

ΔfusH (kJ/mol) Temperature (K) Method Reference Comment
37.400365.7N/ABarone and Della Gatta, 1990DH
33.26369.N/ATong, Tan, et al., 2007AC
37.7368.0DSCCarpentier, Desprez, et al., 2003AC
37.4365.7DSCDomalski and Hearing, 1996See also Barone, Gatta, et al., 1990.; AC

Entropy of fusion

ΔfusS (J/mol*K) Temperature (K) Reference Comment
102.3365.7Barone and Della Gatta, 1990DH

In addition to the Thermodynamics Research Center (TRC) data available from this site, much more physical and chemical property data is available from the following TRC products:

References

Oberemok-Yakubova and Balandin, 1963
Oberemok-Yakubova, A.P.; Balandin, A.A., Determination of the heat of combustion of xylitol, Bull. Acad. Sci. USSR, Div. Chem. Sci., 1963, 2038-2039. [all data]

Barone, DellaGatta, et al., 1990
Barone, G.; DellaGatta, G.; Ferro, D.; Piacente, V., Enthalpies and entropies of sublimation, vaporization and fusion of nine polyhydric alcohols, J. Chem. Soc., Faraday Trans., 1990, 86, 75. [all data]

Barone, Gatta, et al., 1990
Barone, Guido; Gatta, Giuseppe Della; Ferro, Daniela; Piacente, Vincenzo, Enthalpies and entropies of sublimation, vaporization and fusion of nine polyhydric alcohols, Faraday Trans., 1990, 86, 1, 75, https://doi.org/10.1039/ft9908600075 . [all data]

Barone and Della Gatta, 1990
Barone, G.; Della Gatta, G., Ferro D., and Piacente, V., Enthalpies and entropies of sublimation, vaporization and fusion of nine polyhydric alcohols, J. Chem. Soc., Faraday Trans., 1990, 86(1), 75-79. [all data]

Tong, Tan, et al., 2007
Tong, Bo; Tan, Zhi-Cheng; Shi, Quan; Li, Yan-Sheng; Yue, Dan-Ting; Wang, Shao-Xu, Thermodynamic investigation of several natural polyols (I): Heat capacities and thermodynamic properties of xylitol, Thermochimica Acta, 2007, 457, 1-2, 20-26, https://doi.org/10.1016/j.tca.2007.02.022 . [all data]

Carpentier, Desprez, et al., 2003
Carpentier, L.; Desprez, S.; Descamps, M., Journal of Thermal Analysis and Calorimetry, 2003, 73, 2, 577-586, https://doi.org/10.1023/A:1025482230325 . [all data]

Domalski and Hearing, 1996
Domalski, Eugene S.; Hearing, Elizabeth D., Heat Capacities and Entropies of Organic Compounds in the Condensed Phase. Volume III, J. Phys. Chem. Ref. Data, 1996, 25, 1, 1, https://doi.org/10.1063/1.555985 . [all data]