Iron, η4-1,1,3,4-tetramethylsilole tricarbonyl

Gas phase ion energetics data

Data compiled by: Sharon G. Lias, John E. Bartmess, Joel F. Liebman, John L. Holmes, Rhoda D. Levin, and W. Gary Mallard

Ionization energy determinations

IE (eV) Method Reference Comment
7.1PEGuimon, Pfister-Guillouzo, et al., 1985
7.55PEGuimon, Pfister-Guillouzo, et al., 1985Vertical value

References

Guimon, Pfister-Guillouzo, et al., 1985
Guimon, C.; Pfister-Guillouzo, G.; Dubac, J.; Laporterie, A.; Manuel, G.; Iloughmane, H., Electronic structure of Group 14 (η4-metallole)tricarbonyliron complexes, Organometallics, 1985, 4, 636. [all data]