1-Chloro-3,5-diisopropylbenzene

Condensed phase thermochemistry data

Data compiled by: Hussein Y. Afeefy, Joel F. Liebman, and Stephen E. Stein

Quantity Value Units Method Reference Comment
Δfliquid170.0 ± 4.2kJ/molEqkNesterova, Rozhnov, et al., 1985

Reaction thermochemistry data

Data compiled by: Hussein Y. Afeefy, Joel F. Liebman, and Stephen E. Stein

Individual Reactions

1-Chloro-2,5-diisopropylbenzene = 1-Chloro-3,5-diisopropylbenzene

By formula: C12H17Cl = C12H17Cl

Quantity Value Units Method Reference Comment
Δr-2.81 ± 0.96kJ/molEqkNesterova, Rozhnov, et al., 1985liquid phase

References

Nesterova, Rozhnov, et al., 1985
Nesterova, T.N.; Rozhnov, A.M.; Malova, T.N.; Kovzel, E.N., Molar enthalpies of formation of isopropylchlorobenzenes derived from equilibrium measurements, J. Chem. Thermodyn., 1985, 17, 649-656. [all data]