(+)-Diethyl L-tartrate

Condensed phase thermochemistry data

Data compiled by: Hussein Y. Afeefy, Joel F. Liebman, and Stephen E. Stein

Quantity Value Units Method Reference Comment
Δcsolid-3877.3kJ/molCcbWassermann, 1930At 291 K; Corresponding Δfsolid = -1271.6 kJ/mol (simple calculation by NIST; no Washburn corrections)

References

Wassermann, 1930
Wassermann, A., Die zwischenmolekularen Bindungsfestigkeiten der d- und meso-Weinsaure and und ihrer methyl- und athylester, Z. Phys. Chem., 1930, 141, 446-461. [all data]