2,3,4,6-Tetrachloro-1-ethylbenzene

Phase change data

Data compiled as indicated in comments:
TRC - Thermodynamics Research Center, NIST Boulder Laboratories, Chris Muzny director
AC - William E. Acree, Jr., James S. Chickos

Quantity Value Units Method Reference Comment
Tfus501.KN/AWhite, Biggs, et al., 1940Uncertainty assigned by TRC = 2. K; TRC
Tfus360.KN/AColson, 1887Uncertainty assigned by TRC = 1. K; TRC

Enthalpy of vaporization

ΔvapH (kJ/mol) Temperature (K) Method Reference Comment
53.6365.AStephenson and Malanowski, 1987Based on data from 350. - 543. K. See also Stull, 1947.; AC
63.6382.AStephenson and Malanowski, 1987Based on data from 367. - 547. K. See also Dykyj and Vanko, 1970.; AC

Enthalpy of fusion

ΔfusH (kJ/mol) Temperature (K) Reference Comment
21.46359.2Acree, 1991AC

In addition to the Thermodynamics Research Center (TRC) data available from this site, much more physical and chemical property data is available from the following TRC products:

References

White, Biggs, et al., 1940
White, A.H.; Biggs, B.S.; Morgan, S.O., Dielectric Evidence for Molecular Rotation in the Crystals of Certain Benzene Derivatives, J. Am. Chem. Soc., 1940, 62, 16-25. [all data]

Colson, 1887
Colson, XX, C. R. Hebd. Seances Acad. Sci., 1887, 104, 428. [all data]

Stephenson and Malanowski, 1987
Stephenson, Richard M.; Malanowski, Stanislaw, Handbook of the Thermodynamics of Organic Compounds, 1987, https://doi.org/10.1007/978-94-009-3173-2 . [all data]

Stull, 1947
Stull, Daniel R., Vapor Pressure of Pure Substances. Organic and Inorganic Compounds, Ind. Eng. Chem., 1947, 39, 4, 517-540, https://doi.org/10.1021/ie50448a022 . [all data]

Dykyj and Vanko, 1970
Dykyj, J.; Vanko, A., Petrochemica, 1970, 10, 1, 3. [all data]

Acree, 1991
Acree, William E., Thermodynamic properties of organic compounds: enthalpy of fusion and melting point temperature compilation, Thermochimica Acta, 1991, 189, 1, 37-56, https://doi.org/10.1016/0040-6031(91)87098-H . [all data]