Benzene, 1,2,3-trichloro-

Gas phase thermochemistry data

Data compiled by: Hussein Y. Afeefy, Joel F. Liebman, and Stephen E. Stein

Quantity Value Units Method Reference Comment
Δfgas8.2 ± 1.8kJ/molCcrYan, Gu, et al., 1987
Δfgas3.78kJ/molCcrPlatonov and Simulin, 1983

Condensed phase thermochemistry data

Data compiled by: Hussein Y. Afeefy, Joel F. Liebman, and Stephen E. Stein

Quantity Value Units Method Reference Comment
Δfsolid-66.9 ± 1.7kJ/molCcrYan, Gu, et al., 1987
Δfsolid-70.78kJ/molCcrPlatonov and Simulin, 1983
Quantity Value Units Method Reference Comment
Δcsolid-2793.8 ± 1.6kJ/molCcrYan, Gu, et al., 1987
Δcsolid-2789.93kJ/molCcrPlatonov and Simulin, 1983

Phase change data

Data compiled as indicated in comments:
BS - Robert L. Brown and Stephen E. Stein
TRC - Thermodynamics Research Center, NIST Boulder Laboratories, Chris Muzny director
AC - William E. Acree, Jr., James S. Chickos
ALS - Hussein Y. Afeefy, Joel F. Liebman, and Stephen E. Stein

Quantity Value Units Method Reference Comment
Tboil491.7KN/AWeast and Grasselli, 1989BS
Quantity Value Units Method Reference Comment
Tfus323.75KN/ADonnelly, Drewes, et al., 1990Uncertainty assigned by TRC = 0.2 K; TRC
Tfus325.8KN/AMiller, Ghodbane, et al., 1984Uncertainty assigned by TRC = 0.2 K; TRC
Tfus326.9KN/APlato and Glasgow, 1969Uncertainty assigned by TRC = 0.1 K; TRC
Quantity Value Units Method Reference Comment
Δvap57.2kJ/molGCSpieksma, Luijk, et al., 1994Based on data from 413. - 453. K.; AC
Quantity Value Units Method Reference Comment
Δsub75.14 ± 0.75kJ/molCYan, Gu, et al., 1987ALS
Δsub75.1 ± 0.75kJ/molN/AYan, Gu, et al., 1985See also Yan, Gu, et al., 1987, 2.; AC

Enthalpy of vaporization

ΔvapH (kJ/mol) Temperature (K) Method Reference Comment
54.5325.N/ARohác, Ruzicka, et al., 1999AC
54.3258. - 313.GCLiu and Dickhut, 1994AC
53.5308.AStephenson and Malanowski, 1987Based on data from 293. - 383. K.; AC
47.4328.AStephenson and Malanowski, 1987Based on data from 313. - 492. K. See also Stull, 1947.; AC

Antoine Equation Parameters

log10(P) = A − (B / (T + C))
    P = vapor pressure (bar)
    T = temperature (K)

View plot Requires a JavaScript / HTML 5 canvas capable browser.

Temperature (K) A B C Reference Comment
313. - 491.75.235882634.01411.767Stull, 1947Coefficents calculated by NIST from author's data.

Enthalpy of sublimation

ΔsubH (kJ/mol) Temperature (K) Method Reference Comment
72.7258. - 313.N/ALiu and Dickhut, 1994AC
65.7296.RGSears and Hopke, 1949Based on data from 289. - 303. K. See also Jones, 1960.; AC

Enthalpy of fusion

ΔfusH (kJ/mol) Temperature (K) Method Reference Comment
20.5326.9N/AAcree, 1991AC
17.25322.9DSCDonnelly, Drewes, et al., 1990, 2AC

In addition to the Thermodynamics Research Center (TRC) data available from this site, much more physical and chemical property data is available from the following TRC products:

Reaction thermochemistry data

Data compiled by: John E. Bartmess

Individual Reactions

C6H2Cl3- + Hydrogen cation = Benzene, 1,2,3-trichloro-

By formula: C6H2Cl3- + H+ = C6H3Cl3

Quantity Value Units Method Reference Comment
Δr1569. ± 8.8kJ/molG+TSSchlosser, Marzi, et al., 2001gas phase; Acid: 1,2,3-trichlorobenzene. Anion assigned based on ab initio calculations.
Quantity Value Units Method Reference Comment
Δr1535. ± 8.4kJ/molIMRESchlosser, Marzi, et al., 2001gas phase; Acid: 1,2,3-trichlorobenzene. Anion assigned based on ab initio calculations.

Kovats' RI, polar column, isothermal

Data compiled by: NIST Mass Spectrometry Data Center, William E. Wallace, director

Column type CapillaryCapillaryCapillaryCapillaryCapillary
Active phase ZB-WaxZB-WaxCarbowax 20MCarbowax 20MCarbowax 20M
Column length (m) 60.60.22.22.22.
Carrier gas    N2N2
Substrate
Column diameter (mm) 0.250.250.30.30.3
Phase thickness (μm) 0.250.25
Temperature (C) 120.140.160.140.160.
I 1743.21768.61705.1705.1735.
ReferencePérez-Parajón, Santiuste, et al., 2004Pérez-Parajón, Santiuste, et al., 2004Evans and Haken, 1989Haken and Korhonene, 1983Haken and Korhonene, 1983
Comment MSDC-RI MSDC-RI MSDC-RI MSDC-RI MSDC-RI
Column type Capillary
Active phase Carbowax 20M
Column length (m) 22.
Carrier gas N2
Substrate
Column diameter (mm) 0.3
Phase thickness (μm)
Temperature (C) 180.
I 1775.
ReferenceHaken and Korhonene, 1983
Comment MSDC-RI

Van Den Dool and Kratz RI, non-polar column, temperature ramp

Data compiled by: NIST Mass Spectrometry Data Center, William E. Wallace, director

Column type CapillaryCapillaryCapillaryCapillaryCapillary
Active phase DB-5DB-5DB-5DB-1DB-1
Column length (m) 30.30.30.30.30.
Carrier gas N2N2N2N2N2
Substrate
Column diameter (mm) 0.530.530.530.2350.235
Phase thickness (μm) 1.51.51.50.250.25
Tstart (C) 50.50.50.100.100.
Tend (C)
Heat rate (K/min) 2.2.2.10.5.
Initial hold (min)    0.0.
Final hold (min)
I 1194.941201.021206.691204.1199.
ReferenceGerbino, Garbarino, et al., 1996Gerbino, Garbarino, et al., 1996Gerbino, Garbarino, et al., 1996Gerbino and Castello, 1995Gerbino and Castello, 1995
Comment MSDC-RI MSDC-RI MSDC-RI MSDC-RI MSDC-RI
Column type CapillaryCapillary
Active phase DB-1DB-1
Column length (m) 30.30.
Carrier gas N2N2
Substrate
Column diameter (mm) 0.2350.235
Phase thickness (μm) 0.250.25
Tstart (C) 50.50.
Tend (C)
Heat rate (K/min) 10.5.
Initial hold (min) 0.0.
Final hold (min)
I 1190.1183.
ReferenceGerbino and Castello, 1995Gerbino and Castello, 1995
Comment MSDC-RI MSDC-RI

Gas phase ion energetics data

Data compiled as indicated in comments:
B - John E. Bartmess
LLK - Sharon G. Lias, Rhoda D. Levin, and Sherif A. Kafafi

Ionization energy determinations

IE (eV) Method Reference Comment
9.18 ± 0.03PERuscic, Klasinc, et al., 1981LLK
9.22PEStreets and Ceasar, 1973Vertical value; LLK

De-protonation reactions

C6H2Cl3- + Hydrogen cation = Benzene, 1,2,3-trichloro-

By formula: C6H2Cl3- + H+ = C6H3Cl3

Quantity Value Units Method Reference Comment
Δr1569. ± 8.8kJ/molG+TSSchlosser, Marzi, et al., 2001gas phase; Acid: 1,2,3-trichlorobenzene. Anion assigned based on ab initio calculations.; B
Quantity Value Units Method Reference Comment
Δr1535. ± 8.4kJ/molIMRESchlosser, Marzi, et al., 2001gas phase; Acid: 1,2,3-trichlorobenzene. Anion assigned based on ab initio calculations.; B

Van Den Dool and Kratz RI, non-polar column, custom temperature program

Data compiled by: NIST Mass Spectrometry Data Center, William E. Wallace, director

Column type CapillaryPacked
Active phase 5 % Phenyl methyl siloxaneSE-30
Column length (m) 25.3.05
Carrier gas He
Substrate  Supelcoport; Chromosorb
Column diameter (mm) 0.31
Phase thickness (μm) 0.52
Program 50C(2min) => (20C/min) => 120C => (7C/min) => 310C(10min)40C(5min) => 10C/min => 200C or 250C (60min)
I 1207.1214.
ReferenceYasuhara, Shiraishi, et al., 1997Peng, Ding, et al., 1988
Comment MSDC-RI MSDC-RI

Kovats' RI, non-polar column, isothermal

Data compiled by: NIST Mass Spectrometry Data Center, William E. Wallace, director

Column type CapillaryCapillaryCapillaryCapillaryCapillary
Active phase SE-30HP-5HP-5HP-5DB-5
Column length (m)   60.60.30.
Carrier gas   N2N2N2
Substrate
Column diameter (mm)   0.250.250.53
Phase thickness (μm)   0.250.251.5
Temperature (C) 160.120.120.140.110.
I 1224.61228.51228.51207.91224.28
ReferenceSantiuste, Harangi, et al., 2003Santiuste, Harangi, et al., 2003Santiuste J.M. and Takacs J.M., 2003Santiuste J.M. and Takacs J.M., 2003Gerbino, Garbarino, et al., 1996
Comment MSDC-RI MSDC-RI MSDC-RI MSDC-RI MSDC-RI
Column type CapillaryCapillaryCapillaryCapillaryCapillary
Active phase DB-5DB-5SE-30SE-30SE-30
Column length (m) 30.30.25. 25.
Carrier gas N2N2  N2
Substrate
Column diameter (mm) 0.530.530.32 0.22
Phase thickness (μm) 1.51.5
Temperature (C) 70.90.160.160.120.
I 1196.191209.311211.1228.1211.
ReferenceGerbino, Garbarino, et al., 1996Gerbino, Garbarino, et al., 1996Evans and Haken, 1989Tarjan, Nyiredy, et al., 1989Haken and Korhonene, 1983
Comment MSDC-RI MSDC-RI MSDC-RI MSDC-RI MSDC-RI
Column type CapillaryCapillaryPacked
Active phase SE-30SE-30OV-101
Column length (m) 25.25.2.
Carrier gas N2N2
Substrate   Gas Chrom Q
Column diameter (mm) 0.220.22
Phase thickness (μm)
Temperature (C) 140.160.100.
I 1217.1228.1189.
ReferenceHaken and Korhonene, 1983Haken and Korhonene, 1983West and Hall, 1975
Comment MSDC-RI MSDC-RI MSDC-RI

References

Yan, Gu, et al., 1987
Yan, H.; Gu, J.; An, X.; Hu, R., Standard enthalpies of formation and enthlpies of isomerization of trichlorobenzenes, Huaxue Xuebao, 1987, 45, 1184-1187. [all data]

Platonov and Simulin, 1983
Platonov, V.A.; Simulin, Yu.N., Standard enthalpies of formation of 1,2,3-trichlorobenzene, 1,2,4,5-tetrachlorobenzene, and hexachlorobenzene, Russ. J. Phys. Chem. (Engl. Transl.), 1983, 57, 840-842. [all data]

Weast and Grasselli, 1989
CRC Handbook of Data on Organic Compounds, 2nd Editon, Weast,R.C and Grasselli, J.G., ed(s)., CRC Press, Inc., Boca Raton, FL, 1989, 1. [all data]

Donnelly, Drewes, et al., 1990
Donnelly, J.R.; Drewes, L.A.; Johnson, R.L.; Munslow, W.D.; Knapp, K.K.; Sovocool, G.W., Purity and heat of fusion data for environmental standards as determined by differential scanning calorimetry, Thermochim. Acta, 1990, 167, 2, 155, https://doi.org/10.1016/0040-6031(90)80476-F . [all data]

Miller, Ghodbane, et al., 1984
Miller, M.M.; Ghodbane, S.; Wasik, S.P.; Tewari, Y.B.; Martire, D.E., Aqueous Solubilities, Octanol/Water Partition Coefficients, and Entropies of Melting of Chlorinated Benzenes and Biphenyls, J. Chem. Eng. Data, 1984, 29, 184-190. [all data]

Plato and Glasgow, 1969
Plato, C.; Glasgow, A.R., Jr., Differential scanning calorimetry as a general method for determining the purity and heat of fusion of high-purity organic chemicals. Application to 95 compounds, Anal. Chem., 1969, 41, 2, 330, https://doi.org/10.1021/ac60271a041 . [all data]

Spieksma, Luijk, et al., 1994
Spieksma, Walter; Luijk, Ronald; Govers, Harrie A.J., Determination of the liquid vapour pressure of low-volatility compounds from the Kováts retention index, Journal of Chromatography A, 1994, 672, 1-2, 141-148, https://doi.org/10.1016/0021-9673(94)80602-0 . [all data]

Yan, Gu, et al., 1985
Yan, Haike; Gu, Jiangou; Hu, Rihen, Sublimation Calorimeter and the Measurement of Enthalpies of Vaporization and Sublimation of Trichlorobenzenes, Acta Phys. Chim. Sin., 1985, 1, 6, 543-546, https://doi.org/10.3866/PKU.WHXB19850607 . [all data]

Yan, Gu, et al., 1987, 2
Yan, H.; Gu, J.; An, X.; Hu, R.-H., Huaxue Xuebao, 1987, 45, 1184. [all data]

Rohác, Ruzicka, et al., 1999
Rohác, Vladislav; Ruzicka, Vlastimil; Ruzicka, Kvetoslav; Polednicek, Milos; Aim, Karel; Jose, Jacques; Zábranský, Milan, Recommended vapour and sublimation pressures and related thermal data for chlorobenzenes, Fluid Phase Equilibria, 1999, 157, 1, 121-142, https://doi.org/10.1016/S0378-3812(99)00003-5 . [all data]

Liu and Dickhut, 1994
Liu, Kewen; Dickhut, Rebecca M., Saturation vapor pressures and thermodynamic properties of benzene and selected chlorinated benzenes at environmental temperatures, Chemosphere, 1994, 29, 3, 581-589, https://doi.org/10.1016/0045-6535(94)90445-6 . [all data]

Stephenson and Malanowski, 1987
Stephenson, Richard M.; Malanowski, Stanislaw, Handbook of the Thermodynamics of Organic Compounds, 1987, https://doi.org/10.1007/978-94-009-3173-2 . [all data]

Stull, 1947
Stull, Daniel R., Vapor Pressure of Pure Substances. Organic and Inorganic Compounds, Ind. Eng. Chem., 1947, 39, 4, 517-540, https://doi.org/10.1021/ie50448a022 . [all data]

Sears and Hopke, 1949
Sears, G.W.; Hopke, E.R., Vapor Pressures of the Isomeric Trichlorobenzenes in the Low Pressure Region, J. Am. Chem. Soc., 1949, 71, 7, 2575-2576, https://doi.org/10.1021/ja01175a094 . [all data]

Jones, 1960
Jones, A.H., Sublimation Pressure Data for Organic Compounds., J. Chem. Eng. Data, 1960, 5, 2, 196-200, https://doi.org/10.1021/je60006a019 . [all data]

Acree, 1991
Acree, William E., Thermodynamic properties of organic compounds: enthalpy of fusion and melting point temperature compilation, Thermochimica Acta, 1991, 189, 1, 37-56, https://doi.org/10.1016/0040-6031(91)87098-H . [all data]

Donnelly, Drewes, et al., 1990, 2
Donnelly, J.R.; Drewes, L.A.; Johnson, R.L.; Munslow, W.D.; Knapp, K.K.; Sovocool, G.W., Purity and heat of fusion data for environmental standards as determined by differential scanning calorimetry, Thermochimica Acta, 1990, 167, 2, 155-187, https://doi.org/10.1016/0040-6031(90)80476-F . [all data]

Schlosser, Marzi, et al., 2001
Schlosser, M.; Marzi, E.; Cottet, F.; Buker, H.H.; Nibbering, N.M.M., The acidity of chloro-substituted benzenes: A comparison of gas phase, ab initio, and kinetic data, Chem. Eur. J., 2001, 7, 16, 3511-3516, https://doi.org/10.1002/1521-3765(20010817)7:16<3511::AID-CHEM3511>3.0.CO;2-U . [all data]