N≡CCHS

Gas phase ion energetics data

Data compiled by: John E. Bartmess

Electron affinity determinations

EA (eV) Method Reference Comment
1.65 ± 0.16IMRBBorn, Ingemann, et al., 1996

References

Born, Ingemann, et al., 1996
Born, M.; Ingemann, S.; Nibbering, N.M.M., Experimental Determination of the Enthalpies of Formation of Formyl Cyanide and Thioformyl Cyanide in the Gas Phase, J. Phys. Chem., 1996, 100, 44, 17662, https://doi.org/10.1021/jp9609141 . [all data]