2,6-Diisopropylfluorobenzene

Reaction thermochemistry data

Data compiled by: Hussein Y. Afeefy, Joel F. Liebman, and Stephen E. Stein

Individual Reactions

2,6-Diisopropylfluorobenzene = 2,4-Diisopropylfluorobenzene

By formula: C12H17F = C12H17F

Quantity Value Units Method Reference Comment
Δr-0.12 ± 0.17kJ/molEqkMerdzhanov, Nesterova, et al., 1982liquid phase

References

Merdzhanov, Nesterova, et al., 1982
Merdzhanov, V.R.; Nesterova, T.N.; Rozhnov, A.M.; Kuklev, A.M., Study of equilibrium in fluorobenzene systems: isopropylfluorobenzenes, Termodin. Organ. Soedin., 1982, 65-66. [all data]