2-Norbornanethione, 1,3,3-trimethyl-

Gas phase ion energetics data

Data compiled as indicated in comments:
LLK - Sharon G. Lias, Rhoda D. Levin, and Sherif A. Kafafi

Ionization energy determinations

IE (eV) Method Reference Comment
8.13PEFrost, Westwood, et al., 1980LLK
8.41PEGuimon, Gonbeau, et al., 1974Vertical value; LLK

References

Frost, Westwood, et al., 1980
Frost, D.C.; Westwood, N.P.C.; Werstiuk, N.H., Ultraviolet photoelectron spectra of 2-norbornanone, 2,5-norbornanedione. Their akyl derivatives and thio-analogues. An investigation of transannular interactions by photoelectron spectroscopy, Can. J. Chem., 1980, 58, 1659. [all data]

Guimon, Gonbeau, et al., 1974
Guimon, C.; Gonbeau, D.; Pfister-Guillouzo, G.; Asbrink, L.; Sandstrom, J., Electronic structure of sulphur compounds. VI. Photoelectron spectra of some simple thiocarbonyl compounds, J. Electron Spectrosc. Relat. Phenom., 1974, 4, 49. [all data]