3,5-Dimethylanisole

Kovats' RI, non-polar column, isothermal

Data compiled by: NIST Mass Spectrometry Data Center, William E. Wallace, director

Column type PackedPackedPacked
Active phase Apiezon LApiezon LSE-30
Column length (m)   2.
Carrier gas   He
Substrate Chromatone N AW DNCSChromatone N AW DNCSChromosorb W AW DMCS (80-100 mesh)
Column diameter (mm)
Phase thickness (μm)
Temperature (C) 100.150.130.
I 1120.1136.1111.
ReferenceBogoslovsky, Anvaer, et al., 1978Bogoslovsky, Anvaer, et al., 1978Cook and Raushel, 1972
Comment MSDC-RI MSDC-RI MSDC-RI

Normal alkane RI, non-polar column, temperature ramp

Data compiled by: NIST Mass Spectrometry Data Center, William E. Wallace, director

Column type Capillary
Active phase Ultra-1
Column length (m) 25.
Carrier gas He
Substrate
Column diameter (mm) 0.32
Phase thickness (μm) 0.25
Tstart (C) 80.
Tend (C) 260.
Heat rate (K/min) 3.
Initial hold (min)
Final hold (min)
I 1099.
ReferenceOkumura, 1991
Comment MSDC-RI

References

Bogoslovsky, Anvaer, et al., 1978
Bogoslovsky, Yu.N.; Anvaer, B.I.; Vigdergauz, M.S., Chromatographic constants in gas chromatography (in Russian), Standards Publ. House, Moscow, 1978, 192. [all data]

Cook and Raushel, 1972
Cook, L.E.; Raushel, F.M., Calculation of retention indices for benzene and benzene derivatives on the basis of molecular structure, J. Chromatogr., 1972, 65, 3, 556-559, https://doi.org/10.1016/S0021-9673(00)85001-3 . [all data]