Benzoyl chloride, 4-methyl-

Gas phase thermochemistry data

Data compiled by: Hussein Y. Afeefy, Joel F. Liebman, and Stephen E. Stein

Quantity Value Units Method Reference Comment
Δfgas-33.4 ± 1.8kcal/molCmGuthrie, Pike, et al., 1992Hydrolysis

Condensed phase thermochemistry data

Data compiled by: Hussein Y. Afeefy, Joel F. Liebman, and Stephen E. Stein

Quantity Value Units Method Reference Comment
Δfliquid-48.1 ± 1.5kcal/molCmGuthrie, Pike, et al., 1992Hydrolysis

Phase change data

Data compiled as indicated in comments:
BS - Robert L. Brown and Stephen E. Stein
ALS - Hussein Y. Afeefy, Joel F. Liebman, and Stephen E. Stein

Quantity Value Units Method Reference Comment
Tboil499.2KN/AWeast and Grasselli, 1989BS
Quantity Value Units Method Reference Comment
Δvap14.7 ± 1.0kcal/molEGuthrie, Pike, et al., 1992Hydrolysis; ALS

Reduced pressure boiling point

Tboil (K) Pressure (atm) Reference Comment
382. - 384.0.026Frinton Laboratories Inc., 1986BS

Gas phase ion energetics data

Data compiled by: Henry M. Rosenstock, Keith Draxl, Bruce W. Steiner, and John T. Herron

Ionization energy determinations

IE (eV) Method Reference
9.37 ± 0.01EIFoffani, Pignataro, et al., 1964

References

Guthrie, Pike, et al., 1992
Guthrie, J.P.; Pike, D.C.; Lee, Y.-C., Equilibrium constants and heats of formation of methyl esters and N,N-dimethyl amides of substituted benzoic acids, Can. J. Chem., 1992, 70, 1671-1683. [all data]

Weast and Grasselli, 1989
CRC Handbook of Data on Organic Compounds, 2nd Editon, Weast,R.C and Grasselli, J.G., ed(s)., CRC Press, Inc., Boca Raton, FL, 1989, 1. [all data]

Frinton Laboratories Inc., 1986
Frinton Laboratories Inc., Catalog Number 11, Frinton Laboratories Inc., Vineland, NJ, 1986, 99. [all data]

Foffani, Pignataro, et al., 1964
Foffani, A.; Pignataro, S.; Cantone, B.; Grasso, F., Ionization potentials and substituent effects for aromatic carbonyl compounds, Z. Physik. Chem. (Frankfurt), 1964, 42, 221. [all data]