Caryophyllene

Kovats' RI, polar column, temperature ramp

Data compiled by: NIST Mass Spectrometry Data Center, William E. Wallace, director

Column type CapillaryCapillaryCapillaryCapillaryCapillary
Active phase StabilwaxBP-20Supelcowax-10HP-WaxDB-Wax
Column length (m) 30.30.30.50.30.
Carrier gas N2N2 HeHe
Substrate
Column diameter (mm) 0.320.320.250.20.32
Phase thickness (μm) 1.0.250.250.40.25
Tstart (C) 50.60.40.60.40.
Tend (C) 220.220.210.230.220.
Heat rate (K/min) 2.5.2.4.3.
Initial hold (min) 3. 2. 5.
Final hold (min) 15.14.33.30.
I 1620.1615.1589.1625.1576.
ReferenceHazzit, Baaliouamer, et al., 2006Khan, Verma, et al., 2006Sylvestre, Pichette, et al., 2006Gauvin, Lecomte, et al., 2004Lopes, Strobl, et al., 2004
Comment MSDC-RI MSDC-RI MSDC-RI MSDC-RI MSDC-RI
Column type CapillaryCapillaryCapillaryCapillaryCapillary
Active phase InnowaxDB-WaxInnowaxInnowaxSupelcowax-10
Column length (m) 30.30.30.50.30.
Carrier gas He HeHeHe
Substrate
Column diameter (mm) 0.250.250.250.250.32
Phase thickness (μm) 0.250.250.250.250.25
Tstart (C) 40.40.50.50.75.
Tend (C) 190.240.250.180.230.
Heat rate (K/min) 5.2.0.52.53.
Initial hold (min)   5.5.
Final hold (min) 5.40.10.
I 1617.1570.1585.1575.1599.
ReferenceMahmood, Kaul, et al., 2004Nébié, Yaméogo, et al., 2004Viña and Murillo, 2003Yáñez, Pinzón, et al., 2002Tzakou and Couladis, 2001
Comment MSDC-RI MSDC-RI MSDC-RI MSDC-RI MSDC-RI
Column type CapillaryCapillaryCapillaryCapillaryCapillary
Active phase Carbowax 20MCarbowax 20MCarbowax 20MCarbowax 20MCarbowax
Column length (m) 50.50.25.25.30.
Carrier gas   N2N2Ar
Substrate
Column diameter (mm) 0.320.320.250.50.25
Phase thickness (μm) 0.20.2  0.25
Tstart (C) 60.60.60.60.50.
Tend (C) 260.260.200.200.220.
Heat rate (K/min) 2.2.5.5.4.
Initial hold (min)
Final hold (min)
I 1617.1632.1581.1584.1617.
ReferenceVera and Chane-Ming, 1999Vera and Chane-Ming, 1999Kulkarni, Mallavarapu, et al., 1998Mallavarapu, Rao, et al., 1998Szafranek, Malinski, et al., 1998
Comment MSDC-RI MSDC-RI MSDC-RI MSDC-RI MSDC-RI
Column type CapillaryCapillaryCapillaryCapillaryCapillary
Active phase Supelcowax-10Supelcowax-10Supelcowax-10Supelcowax-10Carbowax 20M
Column length (m) 30.30.30.60.50.
Carrier gas    He
Substrate
Column diameter (mm)    0.250.22
Phase thickness (μm)
Tstart (C) 40.40.40.35.80.
Tend (C) 210.210.210.200.200.
Heat rate (K/min) 2.2.2.3.2.
Initial hold (min) 2.2.2.5.
Final hold (min) 120.120.120.20.
I 1579.1579.1588.1598.1617.
ReferenceLoayza, Abujder, et al., 1995Loayza, Abujder, et al., 1995Loayza, Abujder, et al., 1995Wong and Tie, 1993Nishimura, Yamaguchi, et al., 1989
Comment MSDC-RI MSDC-RI MSDC-RI MSDC-RI MSDC-RI
Column type CapillaryCapillaryCapillaryCapillaryCapillary
Active phase Supelcowax-20MDB-WaxCarbowax 20MBP-20Carbowax 20M
Column length (m) 23.60.50.25.50.
Carrier gas H2 He H2
Substrate
Column diameter (mm) 0.320.250.30.3320.3
Phase thickness (μm) 0.30   0.15
Tstart (C) 50.40.70.70.70.
Tend (C) 200.220.210.200.210.
Heat rate (K/min) 3.2.2.4.2.
Initial hold (min) 1.10. 2.
Final hold (min)
I 1587.1585.1581.1617.1577.
ReferenceBicchi, Frattini, et al., 1988Umano and Shibamoto, 1988Randriamiharisoa and Gaydou, 1987Wyllie, Cook, et al., 1987Gaydou, Randriamiharisoa, et al., 1986
Comment MSDC-RI MSDC-RI MSDC-RI MSDC-RI MSDC-RI
Column type CapillaryCapillaryCapillaryCapillaryCapillary
Active phase Carbowax 20MCarbowax 20MCarbowax 20MCarbowax 20MCarbowax 20M
Column length (m) 100.100.50.50.150.
Carrier gas     He
Substrate
Column diameter (mm) 0.280.280.230.230.64
Phase thickness (μm)
Tstart (C) 80.80.80.80.50.
Tend (C) 200.200.200.200.170.
Heat rate (K/min) 3.3.2.2.1.
Initial hold (min)     30.
Final hold (min)
I 1570.1570.1580.1581.1570.
ReferenceBernhard, Shibamoto, et al., 1983Bernhard, Shibamoto, et al., 1983Toda, Mihara, et al., 1983Toda, Mihara, et al., 1983Buttery, Kamm, et al., 1982
Comment MSDC-RI MSDC-RI MSDC-RI MSDC-RI MSDC-RI
Column type CapillaryCapillaryCapillaryCapillaryCapillary
Active phase Carbowax 20MCarbowax 20MCarbowax 20MCarbowax 20MCarbowax 20M
Column length (m) 150.50.50.50.50.
Carrier gas    N2He
Substrate
Column diameter (mm) 0.640.280.280.280.28
Phase thickness (μm)
Tstart (C) 50.80.80.80.70.
Tend (C) 170.200.200.200.190.
Heat rate (K/min) 1.2.2.2.2.
Initial hold (min) 30.
Final hold (min)
I 1570.1568.1570.1642.1594.
ReferenceButtery, Ling, et al., 1982Toda, Yamaguchi, et al., 1982Toda, Yamaguchi, et al., 1982Shibamoto, Kamiya, et al., 1981Tressl, Friese, et al., 1978
Comment MSDC-RI MSDC-RI MSDC-RI MSDC-RI MSDC-RI

Normal alkane RI, polar column, custom temperature program

Data compiled by: NIST Mass Spectrometry Data Center, William E. Wallace, director

Column type CapillaryCapillaryCapillaryCapillaryCapillary
Active phase Innowax FSCInnowax FSCDB-WaxSupelco CO Wax-10HP-FFAP
Column length (m) 60.60.60.60.25.
Carrier gas HeliumHeliumHeliumHeliumHelium
Substrate
Column diameter (mm) 0.250.250.200.320.32
Phase thickness (μm) 0.250.250.250.250.50
Program 60 0C (10 min) 4 0C/min -> 220 0C (10 min) 1 oC/min -> 240 0C60 0C (10 min) 4 0C/min -> 220 0C 1 0C/min -> 240 0C40 0C (3 min) 2 0C/min -> 150 0C 4 0C/min -> 220 0C (20 min) 5 0C/min -> 230 0C35 0C (6 min) 2 0C/min -> 60 0C (5 min) 5 0C/min -> 200 0C 25 0C/min -> 250 0C (6 min)45 0C (2 min) 3 0C/min -> 130 0C (1 min) 20 0C/min -> 220 0C (3 min) 20 0C/min -> 230 0C (3 min)
I 1612.1612.1572.1585.1628.
ReferenceAkin, Saracoglu, et al., 2012Bardakci, Demirci, et al., 2012Gyawali and Kim, 2012Prompona, Kandylis, et al., 2012Toontom, Meenune, et al., 2012
Comment MSDC-RI MSDC-RI MSDC-RI MSDC-RI MSDC-RI
Column type CapillaryCapillaryCapillaryCapillaryCapillary
Active phase Innowax FSCHP-InnowaxHP InnowaxDB-WaxHP Innowax
Column length (m) 60.60.30.30.60.
Carrier gas HeliumHeliumNitrogenHelium
Substrate
Column diameter (mm) 0.250.250.250.250.25
Phase thickness (μm) 0.250.250.250.250.33
Program 60 0C (10 min) 4 0C/min -> 220 0C (10 min) 1 0C/min -> 240 0Cnot specified35 0C (10 min) 3 0C/min -> 205 0C 10 0C/min -> 225 0Cnot specifiednot specified
I 1612.1623.1612.1608.1612.
ReferenceDemirci, Temel, et al., 2011Feng, Zhuang, et al., 2011Laribi, Kouki, et al., 2011Zeng, Xie, et al., 2011Noorizadeh and Farmany, 2010
Comment MSDC-RI MSDC-RI MSDC-RI MSDC-RI MSDC-RI
Column type CapillaryCapillaryCapillaryCapillaryCapillary
Active phase Innowax FSCHP-InnowaxPolyethylene glycol (Free Fatty Acid Phase)Polyethylene glycol (Free Fatty Acid Phase)DB-Wax
Column length (m) 60.30.30.30.15.
Carrier gas HeliumHelium  Helium
Substrate
Column diameter (mm) 0.250.320.250.250.25
Phase thickness (μm) 0.250.50  0.25
Program 60 0C (10 min) 4 0C/min -> 220 0C (10 min) 1 0C/min -> 240 0C50 0C (5 min) 3 0C/min -> 210 0C (10 min) 3 0C/min -> 230 0Cnot specifiednot specified50 0C (5 min) 6 0C/min -> 125 0C 10 0C/min -> 170 0C
I 1612.1632.1575.1590.1558.
ReferencePolatoglu, Demirci, et al., 2010Sun, Hua, et al., 2010Harraca, Syed, et al., 2009Harraca, Syed, et al., 2009Keefover-Ring, Thompson, et al., 2009
Comment MSDC-RI MSDC-RI MSDC-RI MSDC-RI MSDC-RI
Column type CapillaryCapillaryCapillaryCapillaryCapillary
Active phase DB-WaxHP InnowaxHP-20MInnowaxCP-Wax 52 CB
Column length (m) 15.50.25.30.50.
Carrier gas HeliumHeliumHeliumHeliumHelium
Substrate
Column diameter (mm) 0.250.200.200.250.25
Phase thickness (μm) 0.250.250.200.250.29
Program 50 0C (5 min) 6 0C/min -> 125 0C 10 0C/min -> 170 0C40 0C (5 min) 2 0C/min -> 270 0C -> 260 0C (20 min)30 0C (1 min) 50 0C/min -> 110 0C 1.5 0C/min -> 145 0C 4 0C/min -> 220 0C (10 min)not specified33 0C (1 min) 2 0C/min -> 130 0C 10 0C/min -> 220 0C
I 1572.1612.1564.1566.1574.
ReferenceKeefover-Ring, Thompson, et al., 2009Mancini, Arnold, et al., 2009Zellner, Amorim, et al., 2009Aicha, Ines, et al., 2008Kaack and Christensen, 2008
Comment MSDC-RI MSDC-RI MSDC-RI MSDC-RI MSDC-RI
Column type CapillaryCapillaryCapillaryCapillaryCapillary
Active phase PEG 20MHP-Innowax FSCHP-Innowax FSCHP-Innowax FSCHP-20M
Column length (m) 30.60.60.60.
Carrier gas HeliumN2N2N2
Substrate
Column diameter (mm) 0.250.250.250.25
Phase thickness (μm) 0.250.250.250.25
Program 40 0C (3 min) 5 0C/min -> 60 0C 6 0C/min -> 130 0C 10 0C/min -> 230 0C60C(10min) => 4C/min => 220C(10min) => 1C/min => 240C60C(10min) => 4C/min => 220C(10min) => 1C/min => 240C60C(10min) => 4C/min => 220C(10min) => 1C/min => 240Cnot specified
I 1638.1612.1612.1612.1595.
ReferenceZhang, Zhang, et al., 2008Baser K.H.C. and Demirci B., 2007Baser K.H.C. and Demirci B., 2007Baser K.H.C. and Demirci B., 2007Chaieb, Hajlaoui, et al., 2007
Comment MSDC-RI MSDC-RI MSDC-RI MSDC-RI MSDC-RI
Column type CapillaryCapillaryCapillaryCapillaryCapillary
Active phase HP-InnowaxCarbowax 20MAquaWaxCarbowax 20MHP-Innowax
Column length (m) 50.30. 30.30.
Carrier gas HeHe HeHe
Substrate
Column diameter (mm) 0.20.25  0.25
Phase thickness (μm) 0.20.25  0.25
Program 40C(5min) => 2C/min => 250C(15min) => 10C/min => 270Cnot specifiednot specified60C(5min) => 3C/min => 180C => 20C/min => 280C(10min)30C(5min) => 7C/min => 100C(5min) => 1C/min => 130C => 10C/min => 195C(45min)
I 1612.1617.1586.1586.1580.
ReferenceFormisano, Mignola, et al., 2007Hudaib and Aburjai, 2007Liolios, Laouer, et al., 2007Merle, Verdeguer, et al., 2007Narain, Galvao, et al., 2007
Comment MSDC-RI MSDC-RI MSDC-RI MSDC-RI MSDC-RI
Column type CapillaryCapillaryCapillaryCapillaryCapillary
Active phase HP-InnowaxHP-InnowaxHP-Innowax FSCInnowax FSCHP Innowax FSP
Column length (m) 30.30.60.60.60.
Carrier gas HeHeHeHeN2
Substrate
Column diameter (mm) 0.250.250.250.250.25
Phase thickness (μm) 0.250.250.250.250.25
Program 30C(5min) => 7C/min => 100C(5min) => 1C/min => 130C => 10C/min => 195C(45min)30C(5min) => 7C/min => 100C(5min) => 1C/min => 130C => 10C/min => 195C(45min)60C(10min) => 4C/min => 220C(10min) => 1C/min => 240C60C(10min) => 4C/min => 220C (10min) => 1C/min => 240C60C(10min) => 4C/min => 220C(10min) => 1C/min => 240C
I 1585.1567.1612.1612.1612.
ReferenceNarain, Galvao, et al., 2007Narain, Galvao, et al., 2007Tabanca N., Demirci B., et al., 2007Tabanca, Demirci, et al., 2007Tabanca N., Demirci B., et al., 2007, 2
Comment MSDC-RI MSDC-RI MSDC-RI MSDC-RI MSDC-RI
Column type CapillaryCapillaryCapillaryCapillaryCapillary
Active phase DB-WaxPEG-20MInnowax FSCInnowax FSCInnowax FSC
Column length (m) 30.30.60.60.60.
Carrier gas   HeHeHe
Substrate
Column diameter (mm) 0.250.250.250.250.25
Phase thickness (μm) 0.250.250.250.250.25
Program 40 0C (3 min) 3 0C/min -> 150 0C (2 min) 6 0C/min -> 230 0C (10 min)40C(3min) => 5C/min => 60C => 6C/min => 130C => 10C/min => 230C (10min)60C(10min) => 4C/min => 220C (10min) => 1C/min => 240C60C(10min) => 4C/min >220C (10min) => 1C/min => 240C60C(10min) => 4C/min >220C (10min) => 1C/min => 240C
I 1574.1638.1612.1612.1612.
ReferenceWenguang, Wenlai, et al., 2007Zhang C., Zhang H., et al., 2007Baser K.H.C., Ozek G., et al., 2006Baser, Özek, et al., 2006Baser, Özek, et al., 2006
Comment MSDC-RI MSDC-RI MSDC-RI MSDC-RI MSDC-RI
Column type CapillaryCapillaryCapillaryCapillaryCapillary
Active phase HP-Innowax FSCHP-Innowax FSCInnowax FSCCarbowax 20MHP-Innowax
Column length (m) 60.60.60.25.50.
Carrier gas N2HeN2H2He
Substrate
Column diameter (mm) 0.250.250.250.320.2
Phase thickness (μm) 0.250.250.250.250.2
Program 60C(10min) => 4C/min => 220C(10min) => 1C/min => 240C60C(10min) => 4C/min => 220C (10min) => 1C/min => 240C60C(10min) => 4C/min => 220C(10min) => 1C/min => 240C40C(8min) => 3C/min => 180C => 20C/min => 230C (10min)40C(5min) => 2C/min => 250C (15min) => 10C/min => 270C
I 1612.1612.1612.1554.1612.
ReferenceDemirci B., Baser K.H.C., et al., 2006Erdurak, Coskun, et al., 2006Iscan, Kirimer, et al., 2006Lorenzo, Loayza, et al., 2006Senatore, Apostolides Arnold, et al., 2006
Comment MSDC-RI MSDC-RI MSDC-RI MSDC-RI MSDC-RI
Column type CapillaryCapillaryCapillaryCapillaryCapillary
Active phase HP-Innowax FSCHP-Innowax FSCHP-Innowax FSCHP-Innowax FSCSupelcowax-10
Column length (m) 60.60.60.60.30.
Carrier gas He N2N2He
Substrate
Column diameter (mm) 0.250.250.250.250.25
Phase thickness (μm) 0.250.250.250.250.25
Program 60(10min) => 4C/min => 220C(10min) => 1C/min => 240C60C(10min) => 4C/min => 220C (10min) => 1C/min => 240C60C(10min) => 4C/min => 220C => (10min) => 1C/min => 240C60C(10min) => 4C/min => 220C(10min) => 1C/min => 240C40C(3min) => 4C/min => 75C => 8C/min => 260C(5min)
I 1612.1612.1612.1612.1608.
ReferenceSuleimenov Y.M., Atazhanova G.A., et al., 2006Tabanca, Demirci, et al., 2006Tabanca, Demirci, et al., 2006, 2Tunalier, Candan, et al., 2006Vichi, Guadayol, et al., 2006
Comment MSDC-RI MSDC-RI MSDC-RI MSDC-RI MSDC-RI
Column type CapillaryCapillaryCapillaryCapillaryCapillary
Active phase DB-WaxHP-InnowaxHP-Innowax FSCHP-InnowaxDB-Wax
Column length (m) 30.60.60.60.
Carrier gas HeN2N2N2N2
Substrate
Column diameter (mm) 0.250.250.250.25
Phase thickness (μm) 0.250.250.250.25
Program not specified60C(10min) => 4C/min => 220C (10min) => 1C/min => 240C60C(10min) => 4C/min => 220C (10min) => 1C/min => 240C60C(10min) => 4C/min => 220C(10min) => 1C/min => 240Cnot specified
I 1585.1612.1612.1612.1594.
ReferenceBerlinet, Ducruet, et al., 2005Demirci, Demirci, et al., 2005Demirci, Demirci, et al., 2005, 2Duman, Kartal, et al., 2005Pala-Paul, Perez-Alonso, et al., 2005
Comment MSDC-RI MSDC-RI MSDC-RI MSDC-RI MSDC-RI
Column type CapillaryCapillaryCapillaryCapillaryCapillary
Active phase HP-Innowax FSCHP-Innowax FSCHP-Innowax FSCHP Innowax FSPInnowax FSC
Column length (m) 60.60.60.60.60.
Carrier gas HeHeHeN2He
Substrate
Column diameter (mm) 0.250.250.250.250.25
Phase thickness (μm) 0.250.250.250.250.25
Program 60C(10min) => 4C/min => 220C(10min) => 1C/min => 240C60C(10min) => 4C/min => 220C(10min) => 1C/min => 240C60C(10min) => 4C/min => 220C(10min) => 1C/min => 240C60C(10min) => 4C/min => 220C(10min) => 1C/min => 240C60C(10min) => 4C/min => 220C(10min) => 1C/min => 240C
I 1612.1612.1612.1612.1612.
ReferenceSezik E., Kocakulak E., et al., 2005Tabanca, Demirci, et al., 2005Viljoen, Subramoney, et al., 2005Altintas, Kose, et al., 2004Baser, Özek, et al., 2004
Comment MSDC-RI MSDC-RI MSDC-RI MSDC-RI MSDC-RI
Column type CapillaryCapillaryCapillaryCapillaryCapillary
Active phase HP-Innowax FSCHP-Innowax FSCHP-Innowax FSCHP-Innowax FSCHP-Innowax FSC
Column length (m) 60.60.60.60.60.
Carrier gas HeN2HeHeN2
Substrate
Column diameter (mm) 0.250.250.250.250.25
Phase thickness (μm) 0.250.250.250.250.25
Program 60C(10min) => 4C/min => 220C(10min) => 1C/min => 240C60C(10min) => 4C/min => 220C(10min) => 1C/min => 240C60C(10min) => 4C/min => 220C(10min) => 1C/min => 240C60C(10min) => 4C/min => 220C(10min) => 1C/min => 240C60C(10min) => 4C/min => 220C(10min) => 1C/min => 240C
I 1612.1612.1612.1612.1612.
ReferenceDemirci, Paper, et al., 2004Demirci, Paper, et al., 2004, 2Kivcak, Akay, et al., 2004Kivcak, Akay, et al., 2004Klika, Demirci, et al., 2004
Comment MSDC-RI MSDC-RI MSDC-RI MSDC-RI MSDC-RI
Column type CapillaryCapillaryCapillaryCapillaryCapillary
Active phase HP-InnowaxCarbowax 20MCarbowax 20MHP Innowax FSPInnowax FSC
Column length (m) 50.  60.60.
Carrier gas    HeHe
Substrate
Column diameter (mm) 0.2  0.250.25
Phase thickness (μm) 0.2  0.250.25
Program not specifiednot specifiednot specified60C(10min) => 4C/min => 220C(10min) => 1C/min => 240C60C(10min) => 4C/min => 220C (10min) => 1C/min => 240C
I 1612.1622.1595.1612.1612.
ReferenceSenatore, Apostolides Arnold, et al., 2004Vinogradov, 2004Vinogradov, 2004Baser, Demirci, et al., 2003Baser, Demirci, et al., 2003, 2
Comment MSDC-RI MSDC-RI MSDC-RI MSDC-RI MSDC-RI
Column type CapillaryCapillaryCapillaryCapillaryCapillary
Active phase HP-Innowax FSCInnowax FSCHP-Innowax FSCHP-Innowax FSCCarbowax
Column length (m) 60.60.60.60.
Carrier gas HeHeHeHe
Substrate
Column diameter (mm) 0.250.250.250.25
Phase thickness (μm) 0.250.250.250.25
Program 60C (10min) => 4C/min => 220C (10min) => 1C/min => 240C60C (10min) => 4C/min => 220C (10min) => 1C/min => 240C60C(10min) => 4C/min => 220C(10min) => 1C/min => 240C60C(10min) => 4C/min => 220C(10min) => 1C/min => 240Cnot specified
I 1612.1612.1612.1612.1615.
ReferenceDemirci, Baser, et al., 2003Demirci and Baser, 2003Demirci, Dadandi, et al., 2003Demirci, Demirci, et al., 2003Edris, Shalaby, et al., 2003
Comment MSDC-RI MSDC-RI MSDC-RI MSDC-RI MSDC-RI
Column type CapillaryCapillaryCapillaryCapillaryCapillary
Active phase HP-Innowax FSCInnowaxHP-InnowaxInnowax FSCInnowax
Column length (m) 60.60.60.60.60.
Carrier gas HeHeHeHeHe
Substrate
Column diameter (mm) 0.250.250.250.250.25
Phase thickness (μm) 0.250.250.250.250.25
Program 60C(10min) => 4C/min => 220C(10min) => 1C/min => 240C60C(10min) => 4C/min => 220C(10min) => 1C/min => 240C (20min)60 0C (10 min) 4 K/min -> 220 0C (10 min) 1 K/min -> 240 0C60C(10min) => 4C/min => 220C(10min) => 1C/min => 240C60C(10min) => 4C/min => 220C(10min) => 1C/min => 240C
I 1612.1612.1612.1612.1612.
ReferenceErdemoglu, Sener, et al., 2003Tunaher, Kirimer, et al., 2003Baser, Demirci, et al., 2002Baser, Demirei, et al., 2002Baser, Nuriddinov, et al., 2002
Comment MSDC-RI MSDC-RI MSDC-RI MSDC-RI MSDC-RI
Column type CapillaryCapillaryCapillaryCapillaryCapillary
Active phase HP-InnowaxHP-Innowax FSCSupelcowax-10HP-InnowaxHP-Innowax
Column length (m) 60.60.60.60.60.
Carrier gas HeN2HeHeHe
Substrate
Column diameter (mm) 0.250.250.250.250.25
Phase thickness (μm) 0.250.250.250.250.25
Program 60 0C (10 min) 4 K/min -> 220 0C (10 min) 1 K/min -> 240 0C60C(10min) => 4C/min => 220C(10min) => 1C/min => 240C40C (7min) => 4C/min => 150C => 8C/min => 240C (10min)60 0C (10 min) 10 K/min -> 220 0C (10 min) 1K/min -> 240 0C60 0C (10 min) 4 K/min -> 220 0C (10 min) 1 K/min -> 240 0C
I 1612.1612.1613.1612.1612.
ReferenceDemirci, Baser, et al., 2002Hüsnü Can Baser, Demirci, et al., 2002Kim and Lee, 2002Baser, Demirci, et al., 2001Gören, Demirci, et al., 2001
Comment MSDC-RI MSDC-RI MSDC-RI MSDC-RI MSDC-RI
Column type CapillaryCapillaryCapillaryCapillaryCapillary
Active phase HP-Innowax FSCHP-Innowax FSCInnowax FSCInnowax FSCHP-Innowax FSC
Column length (m) 60.60.60.60.60.
Carrier gas HeHeHeHe
Substrate
Column diameter (mm) 0.250.250.250.250.25
Phase thickness (μm) 0.250.250.250.250.25
Program 60C(10min) => 4C/min => 220C(10min) => 1C/min => 240C60C(10min) => 4C/min => 220C(10min) => 1C/min => 240C60C(10min) => 4C/min => 220C(10min) => 1C/min => 240C60C(10min) => 4C/min => 220C(10min) => 1C/min => 240C60C(10min) => 4C/min => 220C(10min) => 1C/min => 240C
I 1612.1612.1612.1612.1612.
ReferenceKirimer N., Tabanea N., et al., 2001Kivcak B., Mert T., et al., 2001Saglam, Gozler, et al., 2001Tabanca N., Demirci F., et al., 2001Tabanca, Kirimer, et al., 2001
Comment MSDC-RI MSDC-RI MSDC-RI MSDC-RI MSDC-RI
Column type CapillaryCapillaryCapillaryCapillaryCapillary
Active phase HP-InnowaxFFAPHP-WaxInnowaxInnowax
Column length (m) 60.50.60.60.60.
Carrier gas He HeHeHe
Substrate
Column diameter (mm) 0.250.20.250.250.25
Phase thickness (μm) 0.250.330.250.250.25
Program 60C(10min) => 4C/min => 220C(10min) => 1C/min => 240C60C(1min) => 2.5C/min => 115C => 1C/min => 210C(30min)50 0C 3 K/min -> 200 0C 8 K/min -> 280 0C60 0C (10 min) 4 K/min -> 220 0C (10 min) 1 K/min -> 240 0C60 0C (10 min) 4 K/min -> 220 0C (10 min) 1 K/min -> 240 0C
I 1612.1607.1615.1612.1612.
ReferenceTabanca, Kirimer, et al., 2001, 2Tucker, Maciarello, et al., 2001Usubillaga, Aparicio, et al., 2001Baser, Özek, et al., 2000Baser, Tabanca, et al., 2000
Comment MSDC-RI MSDC-RI MSDC-RI MSDC-RI MSDC-RI
Column type CapillaryCapillaryCapillaryCapillaryCapillary
Active phase Innowax FSCSupelcowax-10Innowax FSCBP-20DB-Wax
Column length (m) 60. 60. 60.
Carrier gas He He Helium
Substrate
Column diameter (mm) 0.25 0.25 0.32
Phase thickness (μm)   0.25 0.25
Program not specifiednot specified60C(10 min) => 4C/min => 220C(10min) => 1C/min => 240Cnot specifiednot specified
I 1612.1609.1612.1591.1617.
ReferenceDemirci B., Baser K.H.C., et al., 2000Juliani, Biurrun, et al., 2000Kirimer, Tabanca, et al., 2000Muselli, Bighelli, et al., 2000Paniandy, Chane-Ming, et al., 2000
Comment MSDC-RI MSDC-RI MSDC-RI MSDC-RI MSDC-RI
Column type CapillaryCapillaryCapillaryCapillaryCapillary
Active phase Supelcowax-10HP-Innowax FSCHP-InnowaxInnowax FSCInnowax
Column length (m)  60.30.60.60.
Carrier gas  HeHeHelium
Substrate
Column diameter (mm)  0.250.250.250.25
Phase thickness (μm)  0.250.250.250.25
Program not specified60C(10min) => 4C/min => 220C(10min) => 1C/min => 240Cnot specified60 0C (10 min) 4 0C/min -> 220 0C (10 min) 1 0C/min -> 240 0C60C(10min) => 4C/min => 220C(10min) => 1C/min => 240C
I 1579.1607.1582.1612.1607.
ReferenceZunino, Lopez, et al., 2000Bagci, Baser, et al., 1999Bouwmeester, Wallaart, et al., 1999Kirimer, Tabanca, et al., 1999Baser, Kürkcüoglu, et al., 1998
Comment MSDC-RI MSDC-RI MSDC-RI MSDC-RI MSDC-RI
Column type CapillaryCapillaryCapillaryCapillaryCapillary
Active phase FFAPCarbowax 20MDB-WaxDB-WaxCarbowax 20M
Column length (m) 25. 60.60.
Carrier gas H2 N2N2
Substrate
Column diameter (mm) 0.2
Phase thickness (μm) 0.33 0.250.25
Program 40C(5min) => 4C/min => 170C => 8C/min => 240C (12min)not specifiednot specifiednot specifiednot specified
I 1577.1607.1615.1610.1591.
ReferenceReddy, Angers, et al., 1998Vernin, Lageot, et al., 1998Weyerstahl, Marschall, et al., 1998Weyerstahl, Marschall, et al., 1998, 2Davis and Essenberg, 1995
Comment MSDC-RI MSDC-RI MSDC-RI MSDC-RI MSDC-RI
Column type CapillaryCapillaryCapillaryCapillaryCapillary
Active phase Carbowax 20MNB-351Polyethylene GlycolDB-WaxCarbowax 20M
Column length (m)  25. 60.
Carrier gas     He
Substrate
Column diameter (mm)  0.32 0.32
Phase thickness (μm)  0.2
Program not specified40C(5min) => 4C/min => 170C => 8C/min => 240C (12min)not specifiednot specifiednot specified
I 1595.1582.1600.1594.1599.
ReferenceDavis and Essenberg, 1995Kerrola, Galambosi, et al., 1994Vernin, Metzger, et al., 1990Binder and Flath, 1989Peppard and Ramus, 1988
Comment MSDC-RI MSDC-RI MSDC-RI MSDC-RI MSDC-RI
Column type CapillaryCapillaryCapillary
Active phase Carbowax 20MCarbowax 400, Carbowax 20M, Carbowax 1540, Carbowax 4000, Superox 06, PEG 20M, etc.Polyethylene Glycol
Column length (m)  50.
Carrier gas  Hydrogen
Substrate
Column diameter (mm)  0.32
Phase thickness (μm)
Program not specifiednot specifiednot specified
I 1617.1572.1618.
ReferenceShibamoto, 1987Waggott and Davies, 1984MacLeod and Pieris, 1981
Comment MSDC-RI MSDC-RI MSDC-RI

Van Den Dool and Kratz RI, non-polar column, custom temperature program

Data compiled by: NIST Mass Spectrometry Data Center, William E. Wallace, director

Column type CapillaryCapillaryCapillaryCapillaryCapillary
Active phase DB-5SE-52BPX-5BP-5CBP-5
Column length (m) 30.30.30.25.30.
Carrier gas HeHeHeHeHe
Substrate
Column diameter (mm) 0.250.320.250.220.25
Phase thickness (μm) 0.250.150.250.250.25
Program 40C(2min) => 4C/min => 220C => 20C/min => 280C45C => 1C/min => 100C => 5C/min => 250C(10min)35C => 4C/min => 200C => 30C/min => 300C (3min)30C(1min) => 50C/min => 105C => 1.5C/min => 150C => 30C/min => 280C (10min)60C => 3C/min => 246C => 10C/min => 270C (5min)
I 1423.1418.1432.1431.1420.
ReferenceAndrade, Sampaio, et al., 2007Bruni, Bianchi, et al., 2007Dharmawan, Kasapis, et al., 2007Sant'Anna, Fontes, et al., 2007Silva, Oliveira, et al., 2007
Comment MSDC-RI MSDC-RI MSDC-RI MSDC-RI MSDC-RI
Column type CapillaryCapillaryCapillaryCapillaryCapillary
Active phase VF-5MSVF-5MSVF-5MSVF-5MSVF-5MS
Column length (m) 30.30.30.30.30.
Carrier gas HeHeHeHeHe
Substrate
Column diameter (mm) 0.250.250.250.250.25
Phase thickness (μm) 0.250.250.250.250.25
Program 40C(2min) => 5C/min => 200C (2min) => 30C/min => 260C40C(2min) => 5C/min => 200C (2min) => 30C/min => 260C40C(2min) => 5C/min => 200C (2min) => 30C/min => 260C40C(2min) => 5C/min => 200C (2min) => 30C/min => 260C40C(2min) => 5C/min => 200C (2min) => 30C/min => 260C
I 1413.1413.1413.1413.1413.
ReferenceCarasek and Pawliszyn, 2006Carasek and Pawliszyn, 2006Carasek and Pawliszyn, 2006Carasek and Pawliszyn, 2006Carasek and Pawliszyn, 2006
Comment MSDC-RI MSDC-RI MSDC-RI MSDC-RI MSDC-RI
Column type CapillaryCapillaryCapillaryCapillaryCapillary
Active phase BPX-5DB-5MSSE-52DB-5DB-5
Column length (m) 30.30.30.30.
Carrier gas  HeHeHe
Substrate
Column diameter (mm) 0.250.250.320.32
Phase thickness (μm) 0.250.250.150.25
Program 35C(5min) => 3C/min => 210C => 40C/min => 240C (4min)50C(3min) => 200C(2min) => 15C/min => 300C(5min)45C => 1C/min => 100C => 5C/min => 250C (10min)40C(3min) => 3C/min => 180C => 10C/min => 260C(2min)not specified
I 1440.1467.1419.1411.1426.
ReferenceCardeal, da Silva, et al., 2006Eom S.H., Yang H.S., et al., 2006Guerrini, Sacchetti, et al., 2006Moon, Cliff, et al., 2006Özel, Gögüs, et al., 2006
Comment MSDC-RI MSDC-RI MSDC-RI MSDC-RI MSDC-RI
Column type CapillaryCapillaryCapillaryCapillaryCapillary
Active phase DB-5SE-52DB-5DB-5MSSE-52
Column length (m)  30.30.30.30.
Carrier gas  He HeHe
Substrate
Column diameter (mm)  0.320.250.320.32
Phase thickness (μm)  0.150.250.50.15
Program not specified45C => 1C/min => 100C => 5C/min => 250C(10min)40C(2min) => 4C/min => 220C => 20C/min => 280C50C => 5C/min => 200C => 8C/min => 260C(5min)45C => 1C/min => 100C => 5C/min => 250C(10min)
I 1467.1419.1422.1427.1421.
ReferenceÖzel, Gögüs, et al., 2006Sacchetti, Guerrini, et al., 2006Sampaio and Nogueira, 2006Selli, Rannou, et al., 2006Bruni, Pellati, et al., 2005
Comment MSDC-RI MSDC-RI MSDC-RI MSDC-RI MSDC-RI
Column type CapillaryCapillaryCapillaryCapillaryCapillary
Active phase SE-52CBP-55 % Phenyl methyl siloxaneDB-5MSZB-5
Column length (m) 25.30.30.30.30.
Carrier gas H2HeHeHeHelium
Substrate
Column diameter (mm) 0.320.250.320.250.32
Phase thickness (μm) 0.430.250.150.250.50
Program 60C(8min) => 3C/min => 180C => 20C/min => 250C(10min)60C => 3C/min => 240C => 10C/min => 280C(10min)45C => 1C/min => 100C => 5C/min => 250C (10min)40 (5min) => 4C/min => 140C => 4C/min => 200C (20min)not specified
I 1412.1418.1419.1417.1418.
ReferenceLorenzo, Paz, et al., 2005Oliveira, Campos, et al., 2005Sacchetti, Maietti, et al., 2005Zheng, Kim, et al., 2005Bell, 2004
Comment MSDC-RI MSDC-RI MSDC-RI MSDC-RI MSDC-RI
Column type CapillaryCapillaryCapillaryCapillaryCapillary
Active phase SPB-1SE-52CP-Sil5 CB MSDB-1DB-1
Column length (m) 50.25.60.30.30.
Carrier gas  H2HeHeHe
Substrate
Column diameter (mm) 0.250.320.320.320.32
Phase thickness (μm) 0.250.430.250.10.25
Program 70C(3min) => 4C/min => 120C => 8C/min => 250C60C(8min) => 3C/min => 180C => 20C/min => 250C(10min)40C(1min) => 25C/min => 120C => 2C/min => 190C => 25C/min => 250C (5min)40C(5min) => 20C/min => 100C => 2C/min => 160C => 40C/min => 250C (5min)40C(5min) => 20C/min => 100C => 2C/min => 160C => 40C/min => 250C (5min)
I 1428.1413.1417.11391.81404.3
ReferenceDíaz-Maroto, Sánchez Palomo, et al., 2004Frizzo, Lorenzo, et al., 2004Helmig, Bocquet, et al., 2004Helmig, Bocquet, et al., 2004Helmig, Bocquet, et al., 2004
Comment MSDC-RI MSDC-RI MSDC-RI MSDC-RI MSDC-RI
Column type CapillaryCapillaryCapillaryCapillaryCapillary
Active phase SE-52SE-52DB-5MSSE-52CP Sil 8 CB
Column length (m) 25.30.30.25.50.
Carrier gas  HeHeHeHe
Substrate
Column diameter (mm) 0.320.520.250.250.32
Phase thickness (μm) 0.40.150.250.25
Program 60C(8min) => 3C/min => 180C => 20C/min => 250C(10min)45C => 1C/min => 100C => 5C/min => 250C (10min)40C(5min) => 4C/min => 160C => 8C/min => 240C (15min)60C(8min) => 3C/min => 180C => 20C/min => 230C60C (2min) => 5C/min => 160C (1min) => 10C/min => 250C (2min)
I 1417.1419.1423.1415.1418.
ReferenceLorenzo, Paz, et al., 2004Sacchetti, Medici, et al., 2004Kim, Lee, et al., 2003Lorenzo, Loayza, et al., 2003Mockute and Judzentiene, 2003
Comment MSDC-RI MSDC-RI MSDC-RI MSDC-RI MSDC-RI
Column type CapillaryCapillaryCapillaryCapillaryCapillary
Active phase DB-5CBP-5HP-5HP-5SE-52
Column length (m) 30.50.50.50.25.
Carrier gas HeHeHeHeH2
Substrate
Column diameter (mm) 0.250.250.20.20.32
Phase thickness (μm) 0.250.250.330.330.40
Program 60C(2min) => 3C/min => 240C => 10C/min => 270C (4.5min)60C(2min) => 3C/min => 240C => 10C/min => 280C(10min)50C(2min) => 5C/min => 150C => 10C/min => 250C(30min)50C(2min) => 5C/min => 150C => 10C/min => 250C(30min)60 C (8 min) 3 C/min -> 180 C 20 C/min -> 250 C (10 min)
I 1414.1417.1418.1418.1409.
ReferencePassos X.S., Castro A.C.M., et al., 2003Azevedo, Campos, et al., 2002García, Alvarez, et al., 2002García, Alvarez, et al., 2002Lorenzo, Loayza, et al., 2002
Comment MSDC-RI MSDC-RI MSDC-RI MSDC-RI MSDC-RI
Column type CapillaryCapillaryCapillaryCapillaryCapillary
Active phase SE-52SE-52BP-1SE-52SE-52
Column length (m) 30.30.50.25.30.
Carrier gas H2H2 H2H2
Substrate
Column diameter (mm) 0.320.320.220.320.32
Phase thickness (μm) 0.420.420.250.400.40
Program 60C(8min) => 3C/min => 180C => 20C/min => 250C(10min)60C(8min) => 3C/min => 180C => 20C/min => 250C(10min)not specified60 0C (8 min) 3 K/min -> 180 0C 20 K/min -> 250 0C (10 min)60 0C (8 min) 3 K/min -> 180 0C 20 K/min -> 250 0C (10 min)
I 1410.1415.1423.1414.1418.
ReferenceLorenzo, Paz, et al., 2002Lorenzo, Paz, et al., 2002Cavalli, Ranarivelo, et al., 2001Lorenzo, Dellacassa, et al., 2001Lorenzo, Paz, et al., 2001
Comment MSDC-RI MSDC-RI MSDC-RI MSDC-RI MSDC-RI
Column type CapillaryCapillaryCapillaryCapillaryCapillary
Active phase SE-52DB-1BP-1HP-5SE-52
Column length (m) 25.60. 30.25.
Carrier gas HeHe  He
Substrate
Column diameter (mm) 0.250.25 0.250.25
Phase thickness (μm) 0.250.25 0.250.25
Program 60 0C (8 min) 3 K/min -> 180 0C 20 K/min -> 230 0C-20C (5min) => 10C/min => 100C => 4C/min => 200C => 10C/min => 280Cnot specified40C(1min) => 3C/min => 120C => 5C/min => 280C60C(8min) => 3C/min => 180C => 20C/min => 230C
I 1420.1423.1421.1414.1414.
ReferenceLorenzo, Saavedra, et al., 2001Eri, Khoo, et al., 2000Filippini, Tomi, et al., 2000Isidorov, Krajewska, et al., 2000Lorenzo, Dellacassa, et al., 2000
Comment MSDC-RI MSDC-RI MSDC-RI MSDC-RI MSDC-RI
Column type CapillaryCapillary
Active phase SE-52SE-52
Column length (m) 25.60.
Carrier gas HeHe
Substrate
Column diameter (mm) 0.250.32
Phase thickness (μm) 0.250.40
Program 60 0C (8 min) 3 K/min -> 180 0C 20 K/min -> 230 0C45 C (6 min) 3 C/min -> 111 0C 2 C/min -> 160 C 3 C/min -> 300 C (15 min)
I 1423.1427.
ReferenceLoayza, de Groot, et al., 1999Mondello, Dugo, et al., 1995
Comment MSDC-RI MSDC-RI

Normal alkane RI, non-polar column, isothermal

Data compiled by: NIST Mass Spectrometry Data Center, William E. Wallace, director

Column type Packed
Active phase SE-30
Column length (m) 3.2
Carrier gas N2
Substrate Chromosorb P (60-80 mesh)
Column diameter (mm)
Phase thickness (μm)
Temperature (C) 175.
I 1450.
ReferenceThompson, Baker, et al., 1971
Comment MSDC-RI

References

Hazzit, Baaliouamer, et al., 2006
Hazzit, M.; Baaliouamer, A.; Faleiro, M.L.; Miguel, M.G., Composition of the Essential Oils of Thymus and Origanum Species from Algeria and Their Antioxidant and Antimicrobial Activities, J. Agric. Food Chem., 2006, 54, 17, 6314-6321, https://doi.org/10.1021/jf0606104 . [all data]

Khan, Verma, et al., 2006
Khan, M.; Verma, S.C.; Srivastava, S.K.; Shawl, A.S.; Syamsundar, K.V.; Khanuja, S.P.S.; Kumar, T., Essential oil composition of Taxus wallichiana Zucc. from the Northern Himalayan region of India, Flavour Fragr. J., 2006, 21, 5, 772-775, https://doi.org/10.1002/ffj.1682 . [all data]

Sylvestre, Pichette, et al., 2006
Sylvestre, M.; Pichette, A.; Longtin, A.; Nagau, F.; Legault, J., Essential oil analysis and anticancer activity of leaf essential oil of Croton flavens L. from Guadeloupe, J. Ethnopharmacol., 2006, 103, 1, 99-102, https://doi.org/10.1016/j.jep.2005.07.011 . [all data]

Gauvin, Lecomte, et al., 2004
Gauvin, A.; Lecomte, H.; Smadja, J., Comparative investigations of the essential oils of two scented geranium (Pelargonium spp.) cultivars grown on Reunion Island, Flavour Fragr. J., 2004, 19, 5, 455-460, https://doi.org/10.1002/ffj.1354 . [all data]

Lopes, Strobl, et al., 2004
Lopes, D.; Strobl, H.; Kolodziejczyk, P., 14-Methylpentadecano-15-lactone (Muscolide): a new macrocyclic lactone from the oil of Angelica archangelica L., Chemistry and Biodiversity, 2004, 1, 12, 1880-1887, https://doi.org/10.1002/cbdv.200490144 . [all data]

Mahmood, Kaul, et al., 2004
Mahmood, U.; Kaul, V.K.; Acharya, R., Volatile constituents of Capillipedium parviflorum, Phytochemistry, 2004, 65, 14, 2163-2166, https://doi.org/10.1016/j.phytochem.2004.04.003 . [all data]

Nébié, Yaméogo, et al., 2004
Nébié, R.H.C.; Yaméogo, R.T.; Bélanger, A.; Sib, F.S., Composition chimique des huiles essentielles d'Ageratum conyzoïdes du Burkina Faso, C.R. Chim., 2004, 7, 10-11, 1019-1022, https://doi.org/10.1016/j.crci.2003.12.027 . [all data]

Viña and Murillo, 2003
Viña, A.; Murillo, E., Essential oil composition from twelve varieties of basil (Ocimum spp) grown in Columbia, J. Braz. Chem. Soc., 2003, 14, 5, 744-749, https://doi.org/10.1590/S0103-50532003000500008 . [all data]

Yáñez, Pinzón, et al., 2002
Yáñez, X.; Pinzón, M.L.; Solano, F.; Sánchez, L.R., Chemical composition of the essential oil of Psidium caudatum McVaugh, Molecules, 2002, 7, 9, 712-716, https://doi.org/10.3390/70900712 . [all data]

Tzakou and Couladis, 2001
Tzakou, O.; Couladis, M., The essential oil of Micromeria graeca (L.) Bentham et Reichenb. growing in Greece, Flavour Fragr. J., 2001, 16, 2, 107-109, https://doi.org/10.1002/ffj.955 . [all data]

Vera and Chane-Ming, 1999
Vera, R.R.; Chane-Ming, J., Chemical composition of the essential oil of marjoram (Origanum majorana L.) from Reunion Island, Food Chem., 1999, 66, 2, 143-145, https://doi.org/10.1016/S0308-8146(98)00018-1 . [all data]

Kulkarni, Mallavarapu, et al., 1998
Kulkarni, R.N.; Mallavarapu, G.R.; Baskaran, K.; Ramesch, S.; Kumar, S., Composition of the essential oils of two isomenthone-rich variants of geranium (Pelargonium sp.), Flavour Fragr. J., 1998, 13, 6, 389-392, https://doi.org/10.1002/(SICI)1099-1026(199811/12)13:6<389::AID-FFJ757>3.0.CO;2-2 . [all data]

Mallavarapu, Rao, et al., 1998
Mallavarapu, G.R.; Rao, B.R.R.; Kaul, P.N.; Ramesh, S.; Bhattacharya, A.K., Volatile constituents of the essential oils of the seeds and the herb of palmarosa (Cymbopogon martinii (Roxb.) Wats. var. motia Burk.), Flavour Fragr. J., 1998, 13, 3, 167-169, https://doi.org/10.1002/(SICI)1099-1026(199805/06)13:3<167::AID-FFJ719>3.0.CO;2-B . [all data]

Szafranek, Malinski, et al., 1998
Szafranek, B.; Malinski, E.; Szafranek, J., The sesquiterpene composition of leaf cuticular neutral lipids of ten varieties of polish Solanum tuberosum, J. Sci. Food Agric., 1998, 76, 4, 588-592, https://doi.org/10.1002/(SICI)1097-0010(199804)76:4<588::AID-JSFA994>3.0.CO;2-M . [all data]

Loayza, Abujder, et al., 1995
Loayza, I.; Abujder, D.; Aranda, R.; Jakupovic, J.; Collin, G.; Deslauriers, H.; Jean, F.-I., Essential oils of Baccharis salicifolia, B. latifolia and B. dracunculifolia, Phytochemistry, 1995, 38, 2, 381-389, https://doi.org/10.1016/0031-9422(94)00628-7 . [all data]

Wong and Tie, 1993
Wong, K.C.; Tie, D.Y., The Essential Oil of the Leaves of Murraya koenigii Spreng., J. Essent. Oil Res., 1993, 5, 4, 371-374, https://doi.org/10.1080/10412905.1993.9698245 . [all data]

Nishimura, Yamaguchi, et al., 1989
Nishimura, O.; Yamaguchi, K.; Mihara, S.; Shibamoto, T., Volatile Constituents of Guava Fruits (Psidium guajava L.) and Canned Puree, J. Agric. Food Chem., 1989, 37, 1, 139-142, https://doi.org/10.1021/jf00085a033 . [all data]

Bicchi, Frattini, et al., 1988
Bicchi, C.; Frattini, C.; Nano, G.M.; D'Amato, A., On column injection-dual channel analysis of essential oils, J. Hi. Res. Chromatogr. Chromatogr. Comm., 1988, 11, 1, 56-60, https://doi.org/10.1002/jhrc.1240110115 . [all data]

Umano and Shibamoto, 1988
Umano, K.; Shibamoto, T., A new method of headspace sampling: grapefruit volatiles in Flavors and Fragrances: A World Perspective. Proceedings of the 10th International Congress of Essential Oils, Fragrances and Flavors, Lawrence,B.M.; Mookherjee,B.D.; Willis,B.J., ed(s)., Elsevier, New York, 1988, 981-998. [all data]

Randriamiharisoa and Gaydou, 1987
Randriamiharisoa, R.P.; Gaydou, E.M., Composition of Palmarosa (Cymbopogon martinii) essential oil from Madagascar, J. Agric. Food Chem., 1987, 35, 1, 62-66, https://doi.org/10.1021/jf00073a015 . [all data]

Wyllie, Cook, et al., 1987
Wyllie, S.G.; Cook, D.; Brophy, J.J.; Richter, K.M., Volatile flavor components of Annona atemoya (custard apple), J. Agric. Food Chem., 1987, 35, 5, 768-770, https://doi.org/10.1021/jf00077a029 . [all data]

Gaydou, Randriamiharisoa, et al., 1986
Gaydou, E.M.; Randriamiharisoa, R.; Bianchini, J.-P., Composition of the essential oil of ylang-ylang (Canaga odorata Hook Fil. et Thomson forma genuina) from Madagascar, J. Agric. Food Chem., 1986, 34, 3, 481-487, https://doi.org/10.1021/jf00069a028 . [all data]

Bernhard, Shibamoto, et al., 1983
Bernhard, R.A.; Shibamoto, T.; Yamaguchi, K.; White, E., The volatile constituents of Schinus molle L., J. Agric. Food Chem., 1983, 31, 2, 463-466, https://doi.org/10.1021/jf00116a075 . [all data]

Toda, Mihara, et al., 1983
Toda, H.; Mihara, S.; Umano, K.; Shibamoto, T., Photochemical studies on jasmin oil, J. Agric. Food Chem., 1983, 31, 3, 554-558, https://doi.org/10.1021/jf00117a022 . [all data]

Buttery, Kamm, et al., 1982
Buttery, R.G.; Kamm, J.A.; Ling, L.C., Volatile components of alfalfa flowers and pods, J. Agric. Food Chem., 1982, 30, 4, 739-742, https://doi.org/10.1021/jf00112a028 . [all data]

Buttery, Ling, et al., 1982
Buttery, R.G.; Ling, L.C.; Wellso, S.G., Oat leaf volatiles: possible insect attractants, J. Agric. Food Chem., 1982, 30, 4, 791-792, https://doi.org/10.1021/jf00112a045 . [all data]

Toda, Yamaguchi, et al., 1982
Toda, H.; Yamaguchi, K.; Shibamoto, T., Isolation and identification of banana-like aroma from banana shrub (Michellia figo Spreng), J. Agric. Food Chem., 1982, 30, 1, 81-84, https://doi.org/10.1021/jf00109a017 . [all data]

Shibamoto, Kamiya, et al., 1981
Shibamoto, T.; Kamiya, Y.; Mihara, S., Isolation and identification of volatile compounds in cooked meat: sukiyaki, J. Agric. Food Chem., 1981, 29, 1, 57-63, https://doi.org/10.1021/jf00103a015 . [all data]

Tressl, Friese, et al., 1978
Tressl, R.; Friese, L.; Fendesack, F.; Köppler, H., Studies of the volatile composition of hops during storage, J. Agric. Food Chem., 1978, 26, 6, 1426-1430, https://doi.org/10.1021/jf60220a036 . [all data]