Curlone

Kovats' RI, non-polar column, temperature ramp

Data compiled by: NIST Mass Spectrometry Data Center, William E. Wallace, director

Column type CapillaryCapillary
Active phase SPB-1BP-1
Column length (m) 30.25.
Carrier gas HeN2
Substrate
Column diameter (mm) 0.320.55
Phase thickness (μm) 0.250.25
Tstart (C) 60.60.
Tend (C) 225.220.
Heat rate (K/min) 2.5.
Initial hold (min) 3.
Final hold (min) 5.15.
I 1655.1681.
ReferenceJayaprakasha, Jena, et al., 2002Raina, Srivastava, et al., 2002
Comment MSDC-RI MSDC-RI

References

Jayaprakasha, Jena, et al., 2002
Jayaprakasha, G.K.; Jena, B.S.; Negi, P.S.; Sakariah, K.K., Evaluation of antioxidant activities and antimutagenicity of turmeric oil: a byproduct from curcumin production, Z. Naturforsch. C:, 2002, 57c, 828-835, retrieved from http://www.znaturforsch.com/57c/s57c0828.pdf. [all data]

Raina, Srivastava, et al., 2002
Raina, V.K.; Srivastava, S.K.; Jain, N.; Ahmad, A.; Syamasundar, K.V.; Aggarwal, K.K., Essential oil composition of Curcuma longa L. cv. Roma from the plains of northern India, Flavour Fragr. J., 2002, 17, 2, 99-102, https://doi.org/10.1002/ffj.1053 . [all data]