Cyclohexanone, 2-acetyl-

Phase change data

Data compiled by: Robert L. Brown and Stephen E. Stein

Reduced pressure boiling point

Tboil (K) Pressure (atm) Reference
384.70.024Weast and Grasselli, 1989
384.0.024American Tokyo Kasei, 1988
388. - 390.0.026Buckingham and Donaghy, 1982
367. - 369.0.013Buckingham and Donaghy, 1982

References

Weast and Grasselli, 1989
CRC Handbook of Data on Organic Compounds, 2nd Editon, Weast,R.C and Grasselli, J.G., ed(s)., CRC Press, Inc., Boca Raton, FL, 1989, 1. [all data]

American Tokyo Kasei, 1988
American Tokyo Kasei, TCI American Organic Chemical 88/89 Catalog, American Tokyo Kasei, Portland, OR, 1988, 1610. [all data]

Buckingham and Donaghy, 1982
Buckingham, J.; Donaghy, S.M., Dictionary of Organic Compounds: Fifth Edition, Chapman and Hall, New York, 1982, 1. [all data]

Eistert, Merkel, et al., 1954
Eistert, B.; Merkel, E.; Reiss, W., Halochromie und basizitat enolisierbarer β-diketone, Chem. Ber., 1954, 87, 10, 1513-1540. [all data]