2-Pyridinealdoxime

Phase change data

Data compiled by: William E. Acree, Jr., James S. Chickos

Enthalpy of fusion

ΔfusH (kcal/mol) Temperature (K) Reference
4.775388.Shi, Tan, et al., 2007

References

Shi, Tan, et al., 2007
Shi, Quan; Tan, Zhi-Cheng; Tong, Bo; Di, You-Ying; Zhang, Zhi-Heng; Zeng, Ju-Lan; Sun, Li-Xian; Li, Yan-Sheng, Low-temperature heat capacity and standard molar enthalpy of formation of crystalline 2-pyridinealdoxime (C6H6N2O), The Journal of Chemical Thermodynamics, 2007, 39, 5, 817-821, https://doi.org/10.1016/j.jct.2006.09.016 . [all data]