2-Bromo-4-chloroaniline

Normal alkane RI, non-polar column, temperature ramp

Data compiled by: NIST Mass Spectrometry Data Center, William E. Wallace, director

Column type CapillaryCapillary
Active phase TR-1TR-1
Column length (m) 30.30.
Carrier gas HeliumHelium
Substrate
Column diameter (mm) 0.320.32
Phase thickness (μm) 0.250.25
Tstart (C) 50.50.
Tend (C) 300.300.
Heat rate (K/min) 5.5.
Initial hold (min)
Final hold (min)
I 1371.1371.
ReferenceGruzdev, Alferova, et al., 2011Gruzdev, Filippova, et al., 2011
Comment MSDC-RI MSDC-RI

References

Gruzdev, Alferova, et al., 2011
Gruzdev, I.V.; Alferova, M.V.; Kondratenok, B.M.; Zenkevich, I.G., Gas-chromatographic identification of chloro- and bromosubstituted anilines using retention indices, Rus. J. Anal. Chem., 2011, 66, 5, 519-524. [all data]

Gruzdev, Filippova, et al., 2011
Gruzdev, I.V.; Filippova, M.V.; Zenkevich, I.G.; Kondratenok, B.M., Identification of bromination products of chlorosubstituted anilines in aqueous media by using gas chromatography, Rus. J. Applied Chem., 2011, 84, 10, 1656-1667, https://doi.org/10.1134/S1070427211100132 . [all data]