Disodium monofluoride

Gas phase ion energetics data

Data compiled as indicated in comments:
LBLHLM - Sharon G. Lias, John E. Bartmess, Joel F. Liebman, John L. Holmes, Rhoda D. Levin, and W. Gary Mallard

Ionization energy determinations

IE (eV) Method Reference Comment
4.0 ± 0.1PIKappes, Radi, et al., 1985LBLHLM

References

Kappes, Radi, et al., 1985
Kappes, M.M.; Radi, P.; Schar, M.; Schumacher, E., Photoionization measurements on dialkali monohalides generated in supersonic nozzle beams, Chem. Phys. Lett., 1985, 113, 243. [all data]