17-Tetratriacontene

Phase change data

Data compiled by: William E. Acree, Jr., James S. Chickos

Enthalpy of fusion

ΔfusH (kJ/mol) Temperature (K) Method Reference
51.46334.3DSCTyagi, Bisht, et al., 2004

References

Tyagi, Bisht, et al., 2004
Tyagi, Onkar S.; Bisht, Harender S.; Chatterjee, Alok K., Phase Transition, Conformational Disorder, and Chain Packing in Crystalline Long-Chain Symmetrical Alkyl Ethers and Symmetrical Alkenes, J. Phys. Chem. B, 2004, 108, 9, 3010-3016, https://doi.org/10.1021/jp027565x . [all data]