Iridium, η5-pentamethylcyclopentadienyl-dimethyl-s-(dimethylsulfoxide)-

Gas phase ion energetics data

Data compiled by: Sharon G. Lias, John E. Bartmess, Joel F. Liebman, John L. Holmes, Rhoda D. Levin, and W. Gary Mallard

Ionization energy determinations

IE (eV) Method Reference Comment
6.50PEDudeney, Kirchner, et al., 1984
7.01PEDudeney, Kirchner, et al., 1984Vertical value

References

Dudeney, Kirchner, et al., 1984
Dudeney, N.; Kirchner, O.N.; Green, J.C.; Maitlis, P., Electronic structure and reactivity of pentamethylcyclopentadienyl complexes of cobalt, rhodium, and iridium: He-I and He-II photoelectron spectroscopic investigation, J. Chem. Soc. Dalton Trans., 1984, 1877. [all data]