Propyl 3-butoxypropionate

Phase change data

Data compiled by: William E. Acree, Jr., James S. Chickos

Enthalpy of vaporization

ΔvapH (kcal/mol) Temperature (K) Method Reference Comment
10.6388.AStephenson and Malanowski, 1987Based on data from 373. - 473. K. See also Henze and Murchison, 1933.

References

Stephenson and Malanowski, 1987
Stephenson, Richard M.; Malanowski, Stanislaw, Handbook of the Thermodynamics of Organic Compounds, 1987, https://doi.org/10.1007/978-94-009-3173-2 . [all data]

Henze and Murchison, 1933
Henze, Henry R.; Murchison, John T., Alpha Substituted Ethyl n-Butyl Ethers 1, J. Am. Chem. Soc., 1933, 55, 10, 4255-4259, https://doi.org/10.1021/ja01337a065 . [all data]