Hyponitrous acid, dimethyl ester, (E)-

Reaction thermochemistry data

Data compiled by: Hussein Y. Afeefy, Joel F. Liebman, and Stephen E. Stein

Individual Reactions

2Methane, nitroso- = C2H6N2O2

By formula: 2CH3NO = C2H6N2O2

Quantity Value Units Method Reference Comment
Δr-66.9kJ/molEqkChristie, Frost, et al., 1965gas phase

References

Christie, Frost, et al., 1965
Christie, M.I.; Frost, J.S.; Voisey, M.A., Kinetics of some reactions of nitrosoalkanes, Trans. Faraday Soc., 1965, 61, 674-680. [all data]