Urea, N,N-dibutyl-N'-(3-methylphenyl)-

Reaction thermochemistry data

Data compiled by: Hussein Y. Afeefy, Joel F. Liebman, and Stephen E. Stein

Individual Reactions

1-Butanamine, N-butyl- + Benzene, 1-isocyanato-3-methyl- = C16H26N2O

By formula: C8H19N + C8H7NO = C16H26N2O

Quantity Value Units Method Reference Comment
Δr-103.3 ± 0.8kJ/molCmKiselev, Malkov, et al., 1989liquid phase; solvent: Dioxane

References

Kiselev, Malkov, et al., 1989
Kiselev, V.D.; Malkov, V.B.; Murzin, D.G.; Shakirov, I.M.; Konovalov, A.I., Thermochemical study of the reaction of isocyanate with amines, Dokl. Phys. Chem. (Engl. Transl.), 1989, 308, 711-713, In original 111. [all data]