Chlorothiolacetic acid

Reaction thermochemistry data

Data compiled by: Hussein Y. Afeefy, Joel F. Liebman, and Stephen E. Stein

Individual Reactions

Acetone + Chlorothiolacetic acid = Ethanethioic acid, chloro-, S-(1-hydroxy-1-methylethyl) ester

By formula: C3H6O + C2H3ClOS = C5H9ClO2S

Quantity Value Units Method Reference Comment
Δr-28. ± 0.4kJ/molEqkHorii, Kawamura, et al., 1972liquid phase; solvent: CD3COCD3; NMR

References

Horii, Kawamura, et al., 1972
Horii, T.; Kawamura, S.; Tsurugi, J., A NMR study of the thioacetic acid-acetone mixture, Bull. Chem. Soc. Jpn., 1972, 45, 2200-2202. [all data]