Benzonitrile, 3,5-dibromo-4-octanoyloxy-

Condensed phase thermochemistry data

Data compiled by: Hussein Y. Afeefy, Joel F. Liebman, and Stephen E. Stein

Quantity Value Units Method Reference Comment
Δfsolid-599.36kJ/molCcbZavoianu, Ciocazanu, et al., 1988
Quantity Value Units Method Reference Comment
Δcsolid-7946.7kJ/molCcbZavoianu, Ciocazanu, et al., 1988

References

Zavoianu, Ciocazanu, et al., 1988
Zavoianu, D.; Ciocazanu, I.; Moga-Gheorghe, S.; Bornaz, C., Structure and reactivity of nitriles. Heat of combustion and formation of some benzonitrile derivatives, Rev. Chim. (Bucharest), 1988, 39, 487-489. [all data]