Perfluoro-N-(4-methylcyclohexyl)piperidine

Phase change data

Data compiled by: William E. Acree, Jr., James S. Chickos

Quantity Value Units Method Reference Comment
Δvap56.6kJ/molCDruzhinina, Efimova, et al., 2007

Enthalpy of fusion

ΔfusH (kJ/mol) Temperature (K) Method Reference
8.32293.3ACDruzhinina, Efimova, et al., 2007
8.6293.7DSCDruzhinina, Efimova, et al., 2007

References

Druzhinina, Efimova, et al., 2007
Druzhinina, A.I.; Efimova, A.A.; Varushchenko, R.M.; Chelovskaya, N.V., Thermodynamic parameters of phase transitions of perfluoro-N-(4-methylcyclohexyl)piperidine, Russ. J. Phys. Chem., 2007, 81, 12, 2090-2093, https://doi.org/10.1134/S0036024407120308 . [all data]