8,9-Dithiabicyclo[7.2.0]non-1(7)-ene, 2,2,6,6-tetramethyl-

Gas phase ion energetics data

Data compiled as indicated in comments:
LBLHLM - Sharon G. Lias, John E. Bartmess, Joel F. Liebman, John L. Holmes, Rhoda D. Levin, and W. Gary Mallard

Ionization energy determinations

IE (eV) Method Reference Comment
7.7PEJian-qi, Mohraz, et al., 1983LBLHLM
7.95PEJian-qi, Mohraz, et al., 1983Vertical value; LBLHLM

References

Jian-qi, Mohraz, et al., 1983
Jian-qi, W.; Mohraz, M.; Heilbronner, E.; Krebs, A.; Schutz, K.; Voss, J.; Kopke, B., 79. The He(Iα) photoelectron spectra of substituted 1,2-dithietes, Helv. Chim. Acta, 1983, 66, 801. [all data]